{"text_format":"1","workbook":"xlsx","n_sheets":11,"sheets":["Einstellungen","Datenausgabe","Nebenrechnungen","Hinweise","Arbeitgeberkosten","Nettoberechnung Jahr","Nettoberechnung Monat","Prüfung GFB","Berechnungsgrundlagen","Höhergruppierung - HT","SV-Größen"],"not_rendered":{"charts":0,"images":3,"macros":1,"external_links":3,"defined_names":34,"comments":1,"pivot_tables":0},"unopened":[],"bounds":{"document_bytes":16777216,"sheet_cells":100000,"rows_first":2000,"rows_last":500,"rows_between":2000,"halvings":0,"cell_chars":16384,"cell_head_chars":4096},"cells_cut":0,"cells_raw":0,"read":"whole","date_system":"1900"}

{"sheet":"Einstellungen","index":0,"n_rows":161,"n_cols":35,"rows_kept":161,"cut":false,"hidden":true,"merged":[[0,9,0,20]]}
["Zulässige Tarife \n(Bereichname: Tarife):","Max. Stufe","SV Pflicht","ZV Pflicht","Zuwendung Monat","Zuwendung Bemessungsmonat","Zuw Kind","TWNummer",null,"Zulässige Vergütungsgruppen, Bereich jeweils wie Tarif benennen",null,null,null,null,null,null,null,null,null,null,null,null,"Einmalzahlungen / Monat",1,2,3,4,5,6,7,8,9,10,11,12]
["KAVO",12,true,true,11,9,20,206,null,"KAVO nF, EG 15 Ü","TVöD, EG 15 Ü","KAVO, K XII","SuE, TVöD S18","SuE, KAVO S18",null,"BesO, A 5","BesO, B 1","BesO, C 1","BesO, W 1","Priester, P 1","TVL, EG 15 Ü","SuE TVL, S 18","KAVO nF, EG 15 Ü"]
["KAVO nF",6,true,true,11,9,20,"275",null,"KAVO nF, EG 15","TVöD, EG 15","KAVO, K XI","SuE, TVöD S17","SuE, KAVO S17",null,"BesO, A 6","BesO, B 2","BesO, C 2","BesO, W 2","Priester, P 2","TVL, EG 15","SuE TVL, S 17","KAVO nF, EG 15"]
["SuE KAVO",6,true,true,11,9,20,"007",null,"KAVO nF, EG 14","TVöD, EG 14","KAVO, K X","SuE, TVöD S16","SuE, KAVO S16 Ü",null,"BesO, A 7","BesO, B 3","BesO, C 3","BesO, W 3","Priester, P 3","TVL, EG 14","SuE TVL, S 16","KAVO nF, EG 14"]
["TVöD",6,true,true,11,7,0,"075",null,"KAVO nF, EG 13","TVöD, EG 13","KAVO, K IX","SuE, TVöD S15","SuE, KAVO S16",null,"BesO, A 8","BesO, B 4","BesO, C 4",null,"Priester, P 4","TVL, EG 13 Ü","SuE TVL, S 15","KAVO nF, EG 13"]
["SuE TVöD",6,true,true,11,7,25.56,"006",null,"KAVO nF, EG 12","TVöD, EG 12","KAVO, K VIII","SuE, TVöD S14","SuE, KAVO S15",null,"BesO, A 9","BesO, B 5",null,null,null,"TVL, EG 13","SuE TVL, S 14","KAVO nF, EG 12"]
{"$rows_left_out":156}
{"sheet":"Datenausgabe","index":1,"n_rows":197,"n_cols":16,"rows_kept":197,"cut":false,"hidden":true,"merged":[]}
[2020,true,true,true,true,true,true,true,true,true,true,true,true,null,"Erststart:"]
["MonatsNr",1,2,3,4,5,6,7,8,9,10,11,12,null,true]
["Monat","Januar","Februar","März","April","Mai","Juni","Juli","August","September","Oktober","November","Dezember"]
["Tarif","KAVO nF",{"$f":"B4","v":"KAVO nF"},{"$f":"C4","v":"KAVO nF"},"KAVO nF","KAVO nF","KAVO nF","KAVO nF","KAVO nF","KAVO nF","KAVO nF","KAVO nF","KAVO nF",null,"ZuwManuell",true]
["Tarif-2","KAVO nF","KAVO nF",{"$f":"C5","v":"KAVO nF"},"KAVO nF","KAVO nF","KAVO nF","KAVO nF","KAVO nF","KAVO nF","KAVO nF","KAVO nF","KAVO nF",null,"SVManuell",false]
["Tarifgruppe","KAVO nF, EG 15 Ü",{"$f":"B6","v":"KAVO nF, EG 15 Ü"},"KAVO nF, EG 15 Ü","KAVO nF, EG 15 Ü","KAVO nF, EG 15 Ü","KAVO nF, EG 15 Ü","KAVO nF, EG 15 Ü","KAVO nF, EG 15 Ü","KAVO nF, EG 15 Ü","KAVO nF, EG 15 Ü","KAVO nF, EG 15 Ü","KAVO nF, EG 15 Ü",null,"ZVManuell",false]
{"$rows_left_out":192}
{"sheet":"Nebenrechnungen","index":2,"n_rows":331,"n_cols":14,"rows_kept":331,"cut":false,"hidden":true,"merged":[]}
[null,{"$f":"Datenausgabe!B3","v":"Januar"},{"$f":"Datenausgabe!C3","v":"Februar"},{"$f":"Datenausgabe!D3","v":"März"},{"$f":"Datenausgabe!E3","v":"April"},{"$f":"Datenausgabe!F3","v":"Mai"},{"$f":"Datenausgabe!G3","v":"Juni"},{"$f":"Datenausgabe!H3","v":"Juli"},{"$f":"Datenausgabe!I3","v":"August"},{"$f":"Datenausgabe!J3","v":"September"},{"$f":"Datenausgabe!K3","v":"Oktober"},{"$f":"Datenausgabe!L3","v":"November"},{"$f":"Datenausgabe!M3","v":"Dezember"},"Erläuterungen"]
["Tabellenwerte der Vergütungsgruppen ermitteln. Wenn eine Pauschalvergütung eingegeben wurde, diese verwenden"]
["Grundgehalt 1",{"$f":"IF(Datenausgabe!B12<>0,Datenausgabe!B12,VLOOKUP(Datenausgabe!B$6,[2]!Verguetung,Datenausgabe!B$8+1,0))","v":0},{"$f":"IF(Datenausgabe!C12<>0,Datenausgabe!C12,VLOOKUP(Datenausgabe!C$6,[2]!Verguetung,Datenausgabe!C$8+1,0))","v":0},{"$f":"IF(Datenausgabe!D12<>0,Datenausgabe!D12,VLOOKUP(Datenausgabe!D$6,[3]!Verguetung,Datenausgabe!D$8+1,0))","v":0},{"$f":"IF(Datenausgabe!E12<>0,Datenausgabe!E12,VLOOKUP(Datenausgabe!E$6,[3]!Verguetung,Datenausgabe!E$8+1,0))","v":0},{"$f":"IF(Datenausgabe!F12<>0,Datenausgabe!F12,VLOOKUP(Datenausgabe!F$6,[3]!Verguetung,Datenausgabe!F$8+1,0))","v":0},{"$f":"IF(Datenausgabe!G12<>0,Datenausgabe!G12,VLOOKUP(Datenausgabe!G$6,[3]!Verguetung,Datenausgabe!G$8+1,0))","v":0},{"$f":"IF(Datenausgabe!H12<>0,Datenausgabe!H12,VLOOKUP(Datenausgabe!H$6,[3]!Verguetung,Datenausgabe!H$8+1,0))","v":0},{"$f":"IF(Datenausgabe!I12<>0,Datenausgabe!I12,VLOOKUP(Datenausgabe!I$6,[3]!Verguetung,Datenausgabe!I$8+1,0))","v":0},{"$f":"IF(Datenausgabe!J12<>0,Datenausgabe!J12,VLOOKUP(Datenausgabe!J$6,[3]!Verguetung,Datenausgabe!J$8+1,0))","v":0},{"$f":"IF(Datenausgabe!K12<>0,Datenausgabe!K12,VLOOKUP(Datenausgabe!K$6,[3]!Verguetung,Datenausgabe!K$8+1,0))","v":0},{"$f":"IF(Datenausgabe!L12<>0,Datenausgabe!L12,VLOOKUP(Datenausgabe!L$6,[3]!Verguetung,Datenausgabe!L$8+1,0))","v":0},{"$f":"IF(Datenausgabe!M12<>0,Datenausgabe!M12,VLOOKUP(Datenausgabe!M$6,[3]!Verguetung,Datenausgabe!M$8+1,0))","v":0}]
["Grundgehalt 2",{"$f":"IF(Datenausgabe!B13<>0,Datenausgabe!B13,VLOOKUP(Datenausgabe!B$7,[2]!Verguetung,Datenausgabe!B$9+1,0))","v":3613.93},{"$f":"IF(Datenausgabe!C13<>0,Datenausgabe!C13,VLOOKUP(Datenausgabe!C$7,[2]!Verguetung,Datenausgabe!C$9+1,0))","v":3613.93},{"$f":"IF(Datenausgabe!D13<>0,Datenausgabe!D13,VLOOKUP(Datenausgabe!D$7,[3]!Verguetung,Datenausgabe!D$9+1,0))","v":3655.13},{"$f":"IF(Datenausgabe!E13<>0,Datenausgabe!E13,VLOOKUP(Datenausgabe!E$7,[3]!Verguetung,Datenausgabe!E$9+1,0))","v":3655.13},{"$f":"IF(Datenausgabe!F13<>0,Datenausgabe!F13,VLOOKUP(Datenausgabe!F$7,[3]!Verguetung,Datenausgabe!F$9+1,0))","v":3655.13},{"$f":"IF(Datenausgabe!G13<>0,Datenausgabe!G13,VLOOKUP(Datenausgabe!G$7,[3]!Verguetung,Datenausgabe!G$9+1,0))","v":3655.13},{"$f":"IF(Datenausgabe!H13<>0,Datenausgabe!H13,VLOOKUP(Datenausgabe!H$7,[3]!Verguetung,Datenausgabe!H$9+1,0))","v":3655.13},{"$f":"IF(Datenausgabe!I13<>0,Datenausgabe!I13,VLOOKUP(Datenausgabe!I$7,[3]!Verguetung,Datenausgabe!I$9+1,0))","v":3655.13},{"$f":"IF(Datenausgabe!J13<>0,Datenausgabe!J13,VLOOKUP(Datenausgabe!J$7,[3]!Verguetung,Datenausgabe!J$9+1,0))","v":3655.13},{"$f":"IF(Datenausgabe!K13<>0,Datenausgabe!K13,VLOOKUP(Datenausgabe!K$7,[3]!Verguetung,Datenausgabe!K$9+1,0))","v":3655.13},{"$f":"IF(Datenausgabe!L13<>0,Datenausgabe!L13,VLOOKUP(Datenausgabe!L$7,[3]!Verguetung,Datenausgabe!L$9+1,0))","v":3655.13},{"$f":"IF(Datenausgabe!M13<>0,Datenausgabe!M13,VLOOKUP(Datenausgabe!M$7,[3]!Verguetung,Datenausgabe!M$9+1,0))","v":3655.13}]
["GG TZ Klassif:",{"$f":"VALUE(MID(Arbeitgeberkosten!$E$7,5,1))","v":1}," 1 = Teilzeit & Tage ' 2 = ungekürzt' 3 = Tage-Kürzung' 4 = Teilzeit-Kürzung"]
["HT Zulage",{"$f":"IF(AND(Datenausgabe!B16,B3>0,B4>0,B4>B3),(B4-B3)*0.5,0)*IF($B$5=1,Datenausgabe!B20/Datenausgabe!B21*Datenausgabe!B22/Datenausgabe!B26,1)*IF($B$5=2,1,1)*IF($B$5=3,Datenausgabe!B22/Datenausgabe!B26,1)*IF($B$5=4,Datenausgabe!B20/Datenausgabe!B21,1)","v":0},{"$f":"IF(AND(Datenausgabe!C16,C3>0,C4>0,C4>C3),(C4-C3)*0.5,0)*IF($B$5=1,Datenausgabe!C20/Datenausgabe!C21*Datenausgabe!C22/Datenausgabe!C26,1)*IF($B$5=2,1,1)*IF($B$5=3,Datenausgabe!C22/Datenausgabe!C26,1)*IF($B$5=4,Datenausgabe!C20/Datenausgabe!C21,1)","v":0},{"$f":"IF(AND(Datenausgabe!D16,D3>0,D4>0,D4>D3),(D4-D3)*0.5,0)*IF($B$5=1,Datenausgabe!D20/Datenausgabe!D21*Datenausgabe!D22/Datenausgabe!D26,1)*IF($B$5=2,1,1)*IF($B$5=3,Datenausgabe!D22/Datenausgabe!D26,1)*IF($B$5=4,Datenausgabe!D20/Datenausgabe!D21,1)","v":0},{"$f":"IF(AND(Datenausgabe!E16,E3>0,E4>0,E4>E3),(E4-E3)*0.5,0)*IF($B$5=1,Datenausgabe!E20/Datenausgabe!E21*Datenausgabe!E22/Datenausgabe!E26,1)*IF($B$5=2,1,1)*IF($B$5=3,Datenausgabe!E22/Datenausgabe!E26,1)*IF($B$5=4,Datenausgabe!E20/Datenausgabe!E21,1)","v":0},{"$f":"IF(AND(Datenausgabe!F16,F3>0,F4>0,F4>F3),(F4-F3)*0.5,0)*IF($B$5=1,Datenausgabe!F20/Datenausgabe!F21*Datenausgabe!F22/Datenausgabe!F26,1)*IF($B$5=2,1,1)*IF($B$5=3,Datenausgabe!F22/Datenausgabe!F26,1)*IF($B$5=4,Datenausgabe!F20/Datenausgabe!F21,1)","v":0},{"$f":"IF(AND(Datenausgabe!G16,G3>0,G4>0,G4>G3),(G4-G3)*0.5,0)*IF($B$5=1,Datenausgabe!G20/Datenausgabe!G21*Datenausgabe!G22/Datenausgabe!G26,1)*IF($B$5=2,1,1)*IF($B$5=3,Datenausgabe!G22/Datenausgabe!G26,1)*IF($B$5=4,Datenausgabe!G20/Datenausgabe!G21,1)","v":0},{"$f":"IF(AND(Datenausgabe!H16,H3>0,H4>0,H4>H3),(H4-H3)*0.5,0)*IF($B$5=1,Datenausgabe!H20/Datenausgabe!H21*Datenausgabe!H22/Datenausgabe!H26,1)*IF($B$5=2,1,1)*IF($B$5=3,Datenausgabe!H22/Datenausgabe!H26,1)*IF($B$5=4,Datenausgabe!H20/Datenausgabe!H21,1)","v":0},{"$f":"IF(AND(Datenausgabe!I16,I3>0,I4>0,I4>I3),(I4-I3)*0.5,0)*IF($B$5=1,Datenausgabe!I20/Datenausgabe!I21*Datenausgabe!I22/Datenausgabe!I26,1)*IF($B$5=2,1,1)*IF($B$5=3,Datenausgabe!I22/Datenausgabe!I26,1)*IF($B$5=4,Datenausgabe!I20/Datenausgabe!I21,1)","v":0},{"$f":"IF(AND(Datenausgabe!J16,J3>0,J4>0,J4>J3),(J4-J3)*0.5,0)*IF($B$5=1,Datenausgabe!J20/Datenausgabe!J21*Datenausgabe!J22/Datenausgabe!J26,1)*IF($B$5=2,1,1)*IF($B$5=3,Datenausgabe!J22/Datenausgabe!J26,1)*IF($B$5=4,Datenausgabe!J20/Datenausgabe!J21,1)","v":0},{"$f":"IF(AND(Datenausgabe!K16,K3>0,K4>0,K4>K3),(K4-K3)*0.5,0)*IF($B$5=1,Datenausgabe!K20/Datenausgabe!K21*Datenausgabe!K22/Datenausgabe!K26,1)*IF($B$5=2,1,1)*IF($B$5=3,Datenausgabe!K22/Datenausgabe!K26,1)*IF($B$5=4,Datenausgabe!K20/Datenausgabe!K21,1)","v":0},{"$f":"IF(AND(Datenausgabe!L16,L3>0,L4>0,L4>L3),(L4-L3)*0.5,0)*IF($B$5=1,Datenausgabe!L20/Datenausgabe!L21*Datenausgabe!L22/Datenausgabe!L26,1)*IF($B$5=2,1,1)*IF($B$5=3,Datenausgabe!L22/Datenausgabe!L26,1)*IF($B$5=4,Datenausgabe!L20/Datenausgabe!L21,1)","v":0},{"$f":"IF(AND(Datenausgabe!M16,M3>0,M4>0,M4>M3),(M4-M3)*0.5,0)*IF($B$5=1,Datenausgabe!M20/Datenausgabe!M21*Datenausgabe!M22/Datenausgabe!M26,1)*IF($B$5=2,1,1)*IF($B$5=3,Datenausgabe!M22/Datenausgabe!M26,1)*IF($B$5=4,Datenausgabe!M20/Datenausgabe!M21,1)","v":0}]
{"$rows_left_out":326}
{"sheet":"Hinweise","index":3,"n_rows":43,"n_cols":7,"rows_kept":43,"cut":false,"hidden":false,"merged":[[21,0,22,6],[1,5,5,6],[19,0,20,6],[1,0,1,4],[2,0,2,4],[3,0,3,4],[4,0,4,4],[5,0,5,4]]}
["V 20.1",null,null,null,null,null,"© Bischöfliches Generalvikariat Münster, Gr. 612 Zentrale Gehaltsabrechnungsstelle (ZGASt)"]
["Brutto-Arbeitgeberkosten"]
["Jahres-Nettoberechnung"]
["Monats-Nettoberechnung"]
["Prüfung-GFB"]
[{"$f":"Datenausgabe!A1","v":2020}]
{"$rows_left_out":38}
{"sheet":"Arbeitgeberkosten","index":4,"n_rows":59,"n_cols":19,"rows_kept":59,"cut":false,"hidden":false,"merged":[[57,14,57,15],[1,2,1,3],[2,2,2,3],[3,2,3,3]]}
["Brutto Arbeitgeberkosten",null,null,null,null,{"$f":"Datenausgabe!A1","v":2020}]
[null,"Name",null,null,"Familienstand:",null,{"$f":"Datenausgabe!B32","v":"ledig"},"Tarifgruppe:",{"$f":"Datenausgabe!B6","v":"KAVO nF, EG 15 Ü"},null,null,"StKl.",{"$f":"Datenausgabe!B102","v":1},null,"Zuwendung %:",{"$f":"SUM(IF(Nebenrechnungen!B127:M127>0,Nebenrechnungen!B126:M126,0))","v":0}]
[null,"Vorname:",null,null,"Kinder:",null,{"$f":"Datenausgabe!B36","v":0},"Stufe:",{"$f":"Datenausgabe!B8","v":1},null,null,"KFB:",{"$f":"Datenausgabe!B103","v":0}]
[null,"Geburtsdatum:",null,null,"Personalnummer:",null,null,"Beschäftigungsumfang:",null,{"$f":"Datenausgabe!B20&\" / \"&Datenausgabe!B21","v":"39 / 39"},null,"ST Freibetr.:",{"$f":"Datenausgabe!B108","v":0}]
[]
["Nr.",null,null,null,"Klassif.",{"$f":"DATE(Datenausgabe!$A$1,Datenausgabe!B2,1)","v":"2020-01-01"},{"$f":"DATE(Datenausgabe!$A$1,Datenausgabe!C2,1)","v":"2020-02-01"},{"$f":"DATE(Datenausgabe!$A$1,Datenausgabe!D2,1)","v":"2020-03-01"},{"$f":"DATE(Datenausgabe!$A$1,Datenausgabe!E2,1)","v":"2020-04-01"},{"$f":"DATE(Datenausgabe!$A$1,Datenausgabe!F2,1)","v":"2020-05-01"},{"$f":"DATE(Datenausgabe!$A$1,Datenausgabe!G2,1)","v":"2020-06-01"},{"$f":"DATE(Datenausgabe!$A$1,Datenausgabe!H2,1)","v":"2020-07-01"},{"$f":"DATE(Datenausgabe!$A$1,Datenausgabe!I2,1)","v":"2020-08-01"},{"$f":"DATE(Datenausgabe!$A$1,Datenausgabe!J2,1)","v":"2020-09-01"},{"$f":"DATE(Datenausgabe!$A$1,Datenausgabe!K2,1)","v":"2020-10-01"},{"$f":"DATE(Datenausgabe!$A$1,Datenausgabe!L2,1)","v":"2020-11-01"},{"$f":"DATE(Datenausgabe!$A$1,Datenausgabe!M2,1)","v":"2020-12-01"},"Summe","Gesamt"]
{"$rows_left_out":54}
{"sheet":"Nettoberechnung Jahr","index":5,"n_rows":62,"n_cols":19,"rows_kept":62,"cut":false,"hidden":false,"merged":[[60,14,60,15],[1,2,1,3],[2,2,2,3],[3,2,3,3]]}
["Netto Entgeltberechnung",null,null,null,null,{"$f":"Datenausgabe!A1","v":2020}]
[null,"Name",{"$f":"Arbeitgeberkosten!C2","v":0},null,"Familienstand:",null,{"$f":"Arbeitgeberkosten!G2","v":"ledig"},"Tarifgruppe:",{"$f":"Datenausgabe!B6","v":"KAVO nF, EG 15 Ü"},null,null,"StKl.",{"$f":"Datenausgabe!B102","v":1},null,"Zuwendung %:",{"$f":"Arbeitgeberkosten!P2","v":0}]
[null,"Vorname:",{"$f":"Arbeitgeberkosten!C3","v":0},null,"Kinder:",null,{"$f":"Arbeitgeberkosten!G3","v":0},"Stufe:",{"$f":"Datenausgabe!B8","v":1},null,null,"KFB:",{"$f":"Datenausgabe!B103","v":0}]
[null,"Geburtsdatum:",{"$f":"Arbeitgeberkosten!C4","v":0},null,"Personalnummer:",null,{"$f":"Arbeitgeberkosten!G4","v":0},"Beschäftigungsumfang:",null,{"$f":"Datenausgabe!B20&\" / \"&Datenausgabe!B21","v":"39 / 39"},null,"ST Freibetr.:",{"$f":"Datenausgabe!B108","v":0}]
["Nr.",null,null,null,"Klassif.",{"$f":"DATE(Datenausgabe!$A$1,Datenausgabe!B2,1)","v":"2020-01-01"},{"$f":"DATE(Datenausgabe!$A$1,Datenausgabe!C2,1)","v":"2020-02-01"},{"$f":"DATE(Datenausgabe!$A$1,Datenausgabe!D2,1)","v":"2020-03-01"},{"$f":"DATE(Datenausgabe!$A$1,Datenausgabe!E2,1)","v":"2020-04-01"},{"$f":"DATE(Datenausgabe!$A$1,Datenausgabe!F2,1)","v":"2020-05-01"},{"$f":"DATE(Datenausgabe!$A$1,Datenausgabe!G2,1)","v":"2020-06-01"},{"$f":"DATE(Datenausgabe!$A$1,Datenausgabe!H2,1)","v":"2020-07-01"},{"$f":"DATE(Datenausgabe!$A$1,Datenausgabe!I2,1)","v":"2020-08-01"},{"$f":"DATE(Datenausgabe!$A$1,Datenausgabe!J2,1)","v":"2020-09-01"},{"$f":"DATE(Datenausgabe!$A$1,Datenausgabe!K2,1)","v":"2020-10-01"},{"$f":"DATE(Datenausgabe!$A$1,Datenausgabe!L2,1)","v":"2020-11-01"},{"$f":"DATE(Datenausgabe!$A$1,Datenausgabe!M2,1)","v":"2020-12-01"},"Summe","Gesamt"]
[{"$f":"ROW()-5","v":1},"Grundvergütung",null,null,"JJJJ1J",{"$f":"Arbeitgeberkosten!F7","v":0},{"$f":"Arbeitgeberkosten!G7","v":0},{"$f":"Arbeitgeberkosten!H7","v":0},{"$f":"Arbeitgeberkosten!I7","v":0},{"$f":"Arbeitgeberkosten!J7","v":0},{"$f":"Arbeitgeberkosten!K7","v":0},{"$f":"Arbeitgeberkosten!L7","v":0},{"$f":"Arbeitgeberkosten!M7","v":0},{"$f":"Arbeitgeberkosten!N7","v":0},{"$f":"Arbeitgeberkosten!O7","v":0},{"$f":"Arbeitgeberkosten!P7","v":0},{"$f":"Arbeitgeberkosten!Q7","v":0},{"$f":"SUM(F6:Q6)","v":0}]
{"$rows_left_out":57}
{"sheet":"Nettoberechnung Monat","index":6,"n_rows":66,"n_cols":9,"rows_kept":66,"cut":false,"hidden":false,"merged":[[65,5,65,7],[35,5,35,7],[37,5,37,6],[39,5,39,6],[40,5,40,6],[41,5,41,6],[46,5,46,6],[47,5,47,6],[42,5,42,6],[43,5,43,6],[44,5,44,6],[45,5,45,6],[36,5,36,6],[38,5,38,6],[10,1,10,2],[11,1,11,2],[12,1,12,2],[13,1,13,2],[19,6,20,7],[16,5,16,6],[14,1,14,2],[15,1,15,2],[16,1,16,2]]}
[]
[]
[]
[]
[]
[]
{"$rows_left_out":61}
{"sheet":"Prüfung GFB","index":7,"n_rows":50,"n_cols":19,"rows_kept":50,"cut":false,"hidden":false,"merged":[[48,14,48,15],[1,2,1,3],[2,2,2,3],[3,2,3,3]]}
["Prüfung GFB",null,null,null,null,{"$f":"Datenausgabe!A1","v":2020}]
[null,"Name",null,null,"Familienstand:",null,null,"Tarifgruppe:",{"$f":"Datenausgabe!B6","v":"KAVO nF, EG 15 Ü"},null,null,"StKl.",{"$f":"Datenausgabe!B102","v":1}]
[null,"Vorname:",null,null,"Kinder:",null,null,"Stufe:",{"$f":"Datenausgabe!B8","v":1},null,null,"KFB:",{"$f":"Datenausgabe!B103","v":0}]
[null,"Geburtsdatum:",null,null,"Personalnummer:",null,null,"Beschäftigungsumfang:",null,{"$f":"Datenausgabe!B20&\" / \"&Datenausgabe!B21","v":"39 / 39"},null,"ST Freibetr.:",{"$f":"Datenausgabe!B108","v":0}]
[]
["Nr.",null,null,null,"Klassif.",{"$f":"DATE(Datenausgabe!$A$1,Datenausgabe!B2,1)","v":"2020-01-01"},{"$f":"DATE(Datenausgabe!$A$1,Datenausgabe!C2,1)","v":"2020-02-01"},{"$f":"DATE(Datenausgabe!$A$1,Datenausgabe!D2,1)","v":"2020-03-01"},{"$f":"DATE(Datenausgabe!$A$1,Datenausgabe!E2,1)","v":"2020-04-01"},{"$f":"DATE(Datenausgabe!$A$1,Datenausgabe!F2,1)","v":"2020-05-01"},{"$f":"DATE(Datenausgabe!$A$1,Datenausgabe!G2,1)","v":"2020-06-01"},{"$f":"DATE(Datenausgabe!$A$1,Datenausgabe!H2,1)","v":"2020-07-01"},{"$f":"DATE(Datenausgabe!$A$1,Datenausgabe!I2,1)","v":"2020-08-01"},{"$f":"DATE(Datenausgabe!$A$1,Datenausgabe!J2,1)","v":"2020-09-01"},{"$f":"DATE(Datenausgabe!$A$1,Datenausgabe!K2,1)","v":"2020-10-01"},{"$f":"DATE(Datenausgabe!$A$1,Datenausgabe!L2,1)","v":"2020-11-01"},{"$f":"DATE(Datenausgabe!$A$1,Datenausgabe!M2,1)","v":"2020-12-01"},"Summe","Gesamt"]
{"$rows_left_out":45}
{"sheet":"Berechnungsgrundlagen","index":8,"n_rows":41,"n_cols":13,"rows_kept":41,"cut":false,"hidden":false,"merged":[[2,1,2,2],[3,1,3,2],[4,1,4,2]]}
["Berechnungsgrundlagen"]
[]
["Name"]
["Vorname:"]
["Geburtsdatum:"]
["Personalnummer:"]
{"$rows_left_out":36}
{"sheet":"Höhergruppierung - HT","index":9,"n_rows":26,"n_cols":7,"rows_kept":26,"cut":false,"hidden":false,"merged":[[7,1,7,6],[0,1,0,6],[2,3,2,6],[4,3,4,6],[5,3,5,6]]}
[null,"Berechnung Höhergruppierung / Höherw. Tätigkeit"]
[]
[null,"Name:"]
[null,"Vorname:"]
[null,"Personalnummer:"]
[null,"Arbeitgeber / Einrichtung:"]
{"$rows_left_out":21}
{"sheet":"SV-Größen","index":10,"n_rows":20,"n_cols":17,"rows_kept":20,"cut":false,"hidden":false,"merged":[[3,15,3,16],[0,1,0,16],[3,2,3,3],[3,4,3,5],[3,7,3,12],[3,13,3,14]]}
[null,"Übersicht der SV-Bemessungsgrößen (West)"]
[]
[]
[null,"Gilt-ab:","Bemessungsgrenze KV / PV",null,"Bemessungsgrenze RV / AV",null,"Gleitzonenfaktor","Beitragssätze",null,null,null,null,null,"JAE Grenze",null,"Bezugsgröße"]
[null,null,"Jahr","Monat","Jahr","Monat",null,"KV AN ","KV AG","RV","AV","PV","PV Zuschlag \nKinderlose","KV Allgemein","Bestandsfälle PKV","Jahr","Monat"]
[null,null,null,null,null,null,null,"(*)"]
{"$rows_left_out":14}