{"text_format":"1","workbook":"xlsx","n_sheets":11,"sheets":["Einstellungen","Datenausgabe","Nebenrechnungen","Hinweise","Arbeitgeberkosten","Nettoberechnung Jahr","Nettoberechnung Monat","Prüfung GFB","Berechnungsgrundlagen","Höhergruppierung - HT","SV-Größen"],"not_rendered":{"charts":0,"images":3,"macros":1,"external_links":3,"defined_names":34,"comments":1,"pivot_tables":0},"unopened":[],"bounds":{"document_bytes":16777216,"sheet_cells":100000,"rows_first":2000,"rows_last":500,"rows_between":2000,"halvings":0,"cell_chars":16384,"cell_head_chars":4096},"cells_cut":0,"cells_raw":0,"read":"whole","date_system":"1900"}

{"sheet":"Einstellungen","index":0,"n_rows":161,"n_cols":35,"rows_kept":161,"cut":false,"hidden":true,"merged":[[0,9,0,20]]}
["Zulässige Tarife \n(Bereichname: Tarife):","Max. Stufe","SV Pflicht","ZV Pflicht","Zuwendung Monat","Zuwendung Bemessungsmonat","Zuw Kind","TWNummer",null,"Zulässige Vergütungsgruppen, Bereich jeweils wie Tarif benennen",null,null,null,null,null,null,null,null,null,null,null,null,"Einmalzahlungen / Monat",1,2,3,4,5,6,7,8,9,10,11,12]
["KAVO",12,true,true,11,9,20,206,null,"KAVO nF, EG 15 Ü","TVöD, EG 15 Ü","KAVO, K XII","SuE, TVöD S18","SuE, KAVO S18",null,"BesO, A 5","BesO, B 1","BesO, C 1","BesO, W 1","Priester, P 1","TVL, EG 15 Ü","SuE TVL, S 18","KAVO nF, EG 15 Ü"]
["KAVO nF",6,true,true,11,9,20,"275",null,"KAVO nF, EG 15","TVöD, EG 15","KAVO, K XI","SuE, TVöD S17","SuE, KAVO S17",null,"BesO, A 6","BesO, B 2","BesO, C 2","BesO, W 2","Priester, P 2","TVL, EG 15","SuE TVL, S 17","KAVO nF, EG 15"]
["SuE KAVO",6,true,true,11,9,20,"007",null,"KAVO nF, EG 14","TVöD, EG 14","KAVO, K X","SuE, TVöD S16","SuE, KAVO S16 Ü",null,"BesO, A 7","BesO, B 3","BesO, C 3","BesO, W 3","Priester, P 3","TVL, EG 14","SuE TVL, S 16","KAVO nF, EG 14"]
["TVöD",6,true,true,11,7,0,"075",null,"KAVO nF, EG 13","TVöD, EG 13","KAVO, K IX","SuE, TVöD S15","SuE, KAVO S16",null,"BesO, A 8","BesO, B 4","BesO, C 4",null,"Priester, P 4","TVL, EG 13 Ü","SuE TVL, S 15","KAVO nF, EG 13"]
["SuE TVöD",6,true,true,11,7,25.56,"006",null,"KAVO nF, EG 12","TVöD, EG 12","KAVO, K VIII","SuE, TVöD S14","SuE, KAVO S15",null,"BesO, A 9","BesO, B 5",null,null,null,"TVL, EG 13","SuE TVL, S 14","KAVO nF, EG 12"]
["TV-L",6,true,true,11,7,0,"080",null,"KAVO nF, EG 11","TVöD, EG 11","KAVO, K VII","SuE, TVöD S13","SuE, KAVO S14",null,"BesO, A 10","BesO, B 6",null,null,null,"TVL, EG 12","SuE TVL, S 13","KAVO nF, EG 11"]
["SuE TVL",6,true,true,11,7,0,"081",null,"KAVO nF, EG 10","TVöD, EG 10","KAVO, K VI b","SuE, TVöD S12","SuE, KAVO S13 Ü",null,"BesO, A 11","BesO, B 7",null,null,null,"TVL, EG 11","SuE TVL, S 12","KAVO nF, EG 10"]
["BesO A",12,false,false,null,9,null,"001",null,"KAVO nF, EG 9c","TVöD, EG 9c","KAVO, K V c","SuE, TVöD S11b","SuE, KAVO S13",null,"BesO, A 12","BesO, B 8",null,null,null,"TVL, EG 10","SuE TVL, S 11b","KAVO nF, EG 9c"]
["BesO B",1,false,false,null,9,null,"002",null,"KAVO nF, EG 9b","TVöD, EG 9b","KAVO, K V b","SuE, TVöD S11a","SuE, KAVO S12",null,"BesO, A 13","BesO, B 9",null,null,null,"TVL, EG 9b","SuE TVL, S 11a","KAVO nF, EG 9b"]
["BesO C",15,false,false,null,9,null,"003",null,"KAVO nF, EG 9a","TVöD, EG 9a","KAVO, K IV b","SuE, TVöD S10","SuE, KAVO S11b",null,"BesO, A 14","BesO, B 10",null,null,null,"TVL, EG 9a","SuE TVL, S 10","KAVO nF, EG 9a"]
["BesO W",1,false,false,null,9,null,"046",null,"KAVO nF, EG 8","TVöD, EG 8","KAVO, K IV a","SuE, TVöD S9","SuE, KAVO S11a",null,"BesO, A 15","BesO, B 11",null,null,null,"TVL, EG 8","SuE TVL, S 9","KAVO nF, EG 8"]
["Priester",12,false,false,null,9,null,"282",null,"KAVO nF, EG 7","TVöD, EG 7","KAVO, K III","SuE, TVöD S8b","SuE, KAVO S10",null,"BesO, A 16",null,null,null,null,"TVL, EG 7","SuE TVL, S 8b","KAVO nF, EG 7"]
[null,null,null,null,null,null,null,null,null,"KAVO nF, EG 6","TVöD, EG 6","KAVO, K II","SuE, TVöD S8a","SuE, KAVO S9",null,null,null,null,null,null,"TVL, EG 6","SuE TVL, S 8a","KAVO nF, EG 6"]
[null,null,null,null,null,null,null,null,null,"KAVO nF, EG 5","TVöD, EG 5","KAVO, K I b","SuE, TVöD S7","SuE, KAVO S8b",null,null,null,null,null,null,"TVL, EG 5","SuE TVL, S 7","KAVO nF, EG 5"]
[null,null,null,null,null,null,null,null,null,"KAVO nF, EG 4","TVöD, EG 4","KAVO, K I a","SuE, TVöD S4","SuE, KAVO S8a",null,null,null,null,null,null,"TVL, EG 4","SuE TVL, S 4","KAVO nF, EG 4"]
[null,null,null,null,null,null,null,null,null,"KAVO nF, EG 3","TVöD, EG 3","KAVO, K I","SuE, TVöD S3","SuE, KAVO S7",null,null,null,null,null,null,"TVL, EG 3","SuE TVL, S 3","KAVO nF, EG 3"]
[null,null,null,null,null,null,null,null,null,"KAVO nF, EG 2","TVöD, EG 2 Ü",null,"SuE, TVöD S2","SuE, KAVO S4",null,null,null,null,null,null,"TVL, EG 2 Ü","SuE TVL, S 2","KAVO nF, EG 2 Ü"]
[null,null,null,null,null,null,null,null,null,"KAVO nF, EG 1","TVöD, EG 2",null,null,"SuE, KAVO S3",null,null,null,null,null,null,"TVL, EG 2",null,"KAVO nF, EG 2"]
[null,null,null,null,null,null,null,null,null,null,"TVöD, EG 1",null,null,"SuE, KAVO S2",null,null,null,null,null,null,"TVL, EG 1",null,"KAVO nF, EG 1"]
[null,null,null,null,null,null,null,null,null,null,null,null,null,null,null,null,null,null,null,null,null,null,"TVöD, EG 15 Ü"]
[null,null,null,null,null,null,null,null,null,null,null,null,null,null,null,null,null,null,null,null,null,null,"TVöD, EG 15"]
[null,null,null,null,null,null,null,null,null,null,null,null,null,null,null,null,null,null,null,null,null,null,"TVöD, EG 14"]
[null,null,null,null,null,null,null,null,null,null,null,null,null,null,null,null,null,null,null,null,null,null,"TVöD, EG 13"]
[null,null,null,null,null,null,null,null,null,null,null,null,null,null,null,null,null,null,null,null,null,null,"TVöD, EG 12"]
[null,null,null,null,null,null,null,null,null,null,null,null,null,null,null,null,null,null,null,null,null,null,"TVöD, EG 11"]
[null,null,null,null,null,null,null,null,null,null,null,null,null,null,null,null,null,null,null,null,null,null,"TVöD, EG 10"]
["Monatsnamen:","VL Zulagen","Tarifzulage","Anpassungsfaktoren",null,null,null,null,null,null,null,null,null,null,null,null,null,null,null,null,null,null,"TVöD, EG 9c"]
["Januar",0,"keine",1,null,null,null,null,null,null,null,null,null,null,null,null,null,null,null,null,null,null,"TVöD, EG 9b"]
["Februar",6.65,"normal",0.99458000000000002,null,null,null,null,null,null,null,null,null,null,null,null,null,null,null,null,null,null,"TVöD, EG 9a"]
["März",13.29,"kleine Zulage (Lehrer)",0.98916999999999999,null,null,null,null,null,null,null,null,null,null,null,null,null,null,null,null,null,null,"TVöD, EG 9"]
["April",null,null,0.98375000000000001,null,null,null,null,null,null,null,null,null,null,null,null,null,null,null,null,null,null,"TVöD, EG 8"]
["Mai",null,null,0.97833000000000003,null,null,null,null,null,null,null,null,null,null,null,null,null,null,null,null,null,null,"TVöD, EG 7"]
["Juni",null,null,0.97292000000000001,null,null,null,null,null,null,null,null,null,null,null,null,null,null,null,null,null,null,"TVöD, EG 6"]
["Juli",null,null,0.96750000000000003,null,null,null,null,null,null,null,null,null,null,null,null,null,null,null,null,null,null,"TVöD, EG 5"]
["August",null,null,0.96208000000000005,null,null,null,null,null,null,null,null,null,null,null,null,null,null,null,null,null,null,"TVöD, EG 4"]
["September",null,null,null,null,null,null,null,null,null,null,null,null,null,null,null,null,null,null,null,null,null,"TVöD, EG 3"]
["Oktober",null,null,null,null,null,null,null,null,null,null,null,null,null,null,null,null,null,null,null,null,null,"TVöD, EG 2 Ü"]
["November",null,null,null,null,null,null,null,null,null,null,null,null,null,null,null,null,null,null,null,null,null,"TVöD, EG 2"]
["Dezember",null,null,null,null,null,null,null,null,null,null,null,null,null,null,null,null,null,null,null,null,null,"TVöD, EG 1"]
[null,null,null,null,null,null,null,null,null,null,null,null,null,null,null,null,null,null,null,null,null,null,"KAVO, K XII"]
["Familienstände","Verh. Anteil","Persgrp Steuer",null,null,null,null,null,null,null,null,null,null,null,null,null,null,null,null,null,null,null,"KAVO, K XI"]
["ledig","kein","0 = gesetzl. KV",null,null,null,null,null,null,null,null,null,null,null,null,null,null,null,null,null,null,null,"KAVO, K X"]
["verheiratet","halb","1 = privat KV ohne Zuschuss",null,null,null,null,null,null,null,null,null,null,null,null,null,null,null,null,null,null,null,"KAVO, K IX"]
["geschieden","voll","2 = privat KV mit Zuschuss",null,null,null,null,null,null,null,null,null,null,null,null,null,null,null,null,null,null,null,"KAVO, K VIII"]
["verwitwet",null,null,null,null,null,null,null,null,null,null,null,null,null,null,null,null,null,null,null,null,null,"KAVO, K VII"]
[null,null,null,null,null,null,null,null,null,null,null,null,null,null,null,null,null,null,null,null,null,null,"KAVO, K VI b"]
[null,null,null,null,null,null,null,null,null,null,null,null,null,null,null,null,null,null,null,null,null,null,"KAVO, K V c"]
[null,null,null,null,null,null,null,null,null,null,null,null,null,null,null,null,null,null,null,null,null,null,"KAVO, K V b"]
["ZV Kassen","AG Umlage","AN Beitrag","Pausch Grenze",null,null,null,null,null,null,null,null,null,null,null,null,null,null,null,null,null,null,"KAVO, K IV b"]
["KZVK",5.6,0.4,89.48,null,null,null,null,null,null,null,null,null,null,null,null,null,null,null,null,null,null,"KAVO, K IV a"]
["VBL",6.45,1.71,92.03,null,null,null,null,null,null,null,null,null,null,null,null,null,null,null,null,null,null,"KAVO, K III"]
[null,null,null,null,null,null,null,null,null,null,null,null,null,null,null,null,null,null,null,null,null,null,"KAVO, K II"]
[null,null,null,null,null,null,null,null,null,null,null,null,null,null,null,null,null,null,null,null,null,null,"KAVO, K I b"]
[null,null,null,null,null,null,null,null,null,null,null,null,null,null,null,null,null,null,null,null,null,null,"KAVO, K I a"]
[null,null,null,null,null,null,null,null,null,null,null,null,null,null,null,null,null,null,null,null,null,null,"KAVO, K I"]
[null,null,null,null,null,null,null,null,null,null,null,null,null,null,null,null,null,null,null,null,null,null,"SuE, KAVO S18"]
[null,null,null,null,null,null,null,null,null,null,null,null,null,null,null,null,null,null,null,null,null,null,"SuE, KAVO S17"]
[null,null,null,null,null,null,null,null,null,null,null,null,null,null,null,null,null,null,null,null,null,null,"SuE, KAVO S16 Ü"]
[null,null,null,null,null,null,null,null,null,null,null,null,null,null,null,null,null,null,null,null,null,null,"SuE, KAVO S16"]
[null,null,null,null,null,null,null,null,null,null,null,null,null,null,null,null,null,null,null,null,null,null,"SuE, KAVO S15"]
[null,null,null,null,null,null,null,null,null,null,null,null,null,null,null,null,null,null,null,null,null,null,"SuE, KAVO S14"]
[null,null,null,null,null,null,null,null,null,null,null,null,null,null,null,null,null,null,null,null,null,null,"SuE, KAVO S13 Ü"]
[null,null,null,null,null,null,null,null,null,null,null,null,null,null,null,null,null,null,null,null,null,null,"SuE, KAVO S13"]
[null,null,null,null,null,null,null,null,null,null,null,null,null,null,null,null,null,null,null,null,null,null,"SuE, KAVO S12"]
[null,null,null,null,null,null,null,null,null,null,null,null,null,null,null,null,null,null,null,null,null,null,"SuE, KAVO S11b"]
[null,null,null,null,null,null,null,null,null,null,null,null,null,null,null,null,null,null,null,null,null,null,"SuE, KAVO S11a"]
[null,null,null,null,null,null,null,null,null,null,null,null,null,null,null,null,null,null,null,null,null,null,"SuE, KAVO S10"]
[null,null,null,null,null,null,null,null,null,null,null,null,null,null,null,null,null,null,null,null,null,null,"SuE, KAVO S9"]
[null,null,null,null,null,null,null,null,null,null,null,null,null,null,null,null,null,null,null,null,null,null,"SuE, KAVO S8b"]
[null,null,null,null,null,null,null,null,null,null,null,null,null,null,null,null,null,null,null,null,null,null,"SuE, KAVO S8a"]
[null,null,null,null,null,null,null,null,null,null,null,null,null,null,null,null,null,null,null,null,null,null,"SuE, KAVO S7"]
[null,null,null,null,null,null,null,null,null,null,null,null,null,null,null,null,null,null,null,null,null,null,"SuE, KAVO S4"]
[null,null,null,null,null,null,null,null,null,null,null,null,null,null,null,null,null,null,null,null,null,null,"SuE, KAVO S3"]
[null,null,null,null,null,null,null,null,null,null,null,null,null,null,null,null,null,null,null,null,null,null,"SuE, KAVO S2"]
[null,null,null,null,null,null,null,null,null,null,null,null,null,null,null,null,null,null,null,null,null,null,"SuE, TVöD S18"]
[null,null,null,null,null,null,null,null,null,null,null,null,null,null,null,null,null,null,null,null,null,null,"SuE, TVöD S17"]
[null,null,null,null,null,null,null,null,null,null,null,null,null,null,null,null,null,null,null,null,null,null,"SuE, TVöD S16"]
[null,null,null,null,null,null,null,null,null,null,null,null,null,null,null,null,null,null,null,null,null,null,"SuE, TVöD S15"]
[null,null,null,null,null,null,null,null,null,null,null,null,null,null,null,null,null,null,null,null,null,null,"SuE, TVöD S14"]
[null,null,null,null,null,null,null,null,null,null,null,null,null,null,null,null,null,null,null,null,null,null,"SuE, TVöD S13"]
[null,null,null,null,null,null,null,null,null,null,null,null,null,null,null,null,null,null,null,null,null,null,"SuE, TVöD S12"]
[null,null,null,null,null,null,null,null,null,null,null,null,null,null,null,null,null,null,null,null,null,null,"SuE, TVöD S11b"]
[null,null,null,null,null,null,null,null,null,null,null,null,null,null,null,null,null,null,null,null,null,null,"SuE, TVöD S11a"]
[null,null,null,null,null,null,null,null,null,null,null,null,null,null,null,null,null,null,null,null,null,null,"SuE, TVöD S10"]
[null,null,null,null,null,null,null,null,null,null,null,null,null,null,null,null,null,null,null,null,null,null,"SuE, TVöD S9"]
[null,null,null,null,null,null,null,null,null,null,null,null,null,null,null,null,null,null,null,null,null,null,"SuE, TVöD S8b"]
[null,null,null,null,null,null,null,null,null,null,null,null,null,null,null,null,null,null,null,null,null,null,"SuE, TVöD S8a"]
[null,null,null,null,null,null,null,null,null,null,null,null,null,null,null,null,null,null,null,null,null,null,"SuE, TVöD S7"]
[null,null,null,null,null,null,null,null,null,null,null,null,null,null,null,null,null,null,null,null,null,null,"SuE, TVöD S4"]
[null,null,null,null,null,null,null,null,null,null,null,null,null,null,null,null,null,null,null,null,null,null,"SuE, TVöD S3"]
[null,null,null,null,null,null,null,null,null,null,null,null,null,null,null,null,null,null,null,null,null,null,"SuE, TVöD S2"]
[]
[]
[null,null,null,null,null,null,null,null,null,null,null,null,null,null,null,null,null,null,null,null,null,null,"BesO, A 5"]
[null,null,null,null,null,null,null,null,null,null,null,null,null,null,null,null,null,null,null,null,null,null,"BesO, A 6"]
[null,null,null,null,null,null,null,null,null,null,null,null,null,null,null,null,null,null,null,null,null,null,"BesO, A 7"]
[null,null,null,null,null,null,null,null,null,null,null,null,null,null,null,null,null,null,null,null,null,null,"BesO, A 8"]
[null,null,null,null,null,null,null,null,null,null,null,null,null,null,null,null,null,null,null,null,null,null,"BesO, A 9"]
[null,null,null,null,null,null,null,null,null,null,null,null,null,null,null,null,null,null,null,null,null,null,"BesO, A 10"]
[null,null,null,null,null,null,null,null,null,null,null,null,null,null,null,null,null,null,null,null,null,null,"BesO, A 11"]
[null,null,null,null,null,null,null,null,null,null,null,null,null,null,null,null,null,null,null,null,null,null,"BesO, A 12"]
[null,null,null,null,null,null,null,null,null,null,null,null,null,null,null,null,null,null,null,null,null,null,"BesO, A 13"]
[null,null,null,null,null,null,null,null,null,null,null,null,null,null,null,null,null,null,null,null,null,null,"BesO, A 14"]
[null,null,null,null,null,null,null,null,null,null,null,null,null,null,null,null,null,null,null,null,null,null,"BesO, A 15"]
[null,null,null,null,null,null,null,null,null,null,null,null,null,null,null,null,null,null,null,null,null,null,"BesO, A 16"]
[null,null,null,null,null,null,null,null,null,null,null,null,null,null,null,null,null,null,null,null,null,null,"BesO, B 1"]
[null,null,null,null,null,null,null,null,null,null,null,null,null,null,null,null,null,null,null,null,null,null,"BesO, B 2"]
[null,null,null,null,null,null,null,null,null,null,null,null,null,null,null,null,null,null,null,null,null,null,"BesO, B 3"]
[null,null,null,null,null,null,null,null,null,null,null,null,null,null,null,null,null,null,null,null,null,null,"BesO, B 4"]
[null,null,null,null,null,null,null,null,null,null,null,null,null,null,null,null,null,null,null,null,null,null,"BesO, B 5"]
[null,null,null,null,null,null,null,null,null,null,null,null,null,null,null,null,null,null,null,null,null,null,"BesO, B 6"]
[null,null,null,null,null,null,null,null,null,null,null,null,null,null,null,null,null,null,null,null,null,null,"BesO, B 7"]
[null,null,null,null,null,null,null,null,null,null,null,null,null,null,null,null,null,null,null,null,null,null,"BesO, B 8"]
[null,null,null,null,null,null,null,null,null,null,null,null,null,null,null,null,null,null,null,null,null,null,"BesO, B 9"]
[null,null,null,null,null,null,null,null,null,null,null,null,null,null,null,null,null,null,null,null,null,null,"BesO, B 10"]
[null,null,null,null,null,null,null,null,null,null,null,null,null,null,null,null,null,null,null,null,null,null,"BesO, B 11"]
[null,null,null,null,null,null,null,null,null,null,null,null,null,null,null,null,null,null,null,null,null,null,"BesO, W 1"]
[null,null,null,null,null,null,null,null,null,null,null,null,null,null,null,null,null,null,null,null,null,null,"BesO, W 2"]
[null,null,null,null,null,null,null,null,null,null,null,null,null,null,null,null,null,null,null,null,null,null,"BesO, W 3"]
[null,null,null,null,null,null,null,null,null,null,null,null,null,null,null,null,null,null,null,null,null,null,"Priester, P 1"]
[null,null,null,null,null,null,null,null,null,null,null,null,null,null,null,null,null,null,null,null,null,null,"Priester, P 2"]
[null,null,null,null,null,null,null,null,null,null,null,null,null,null,null,null,null,null,null,null,null,null,"Priester, P 3"]
[null,null,null,null,null,null,null,null,null,null,null,null,null,null,null,null,null,null,null,null,null,null,"Priester, P 4"]
[null,null,null,null,null,null,null,null,null,null,null,null,null,null,null,null,null,null,null,null,null,null,"TVL, EG 15 Ü"]
[null,null,null,null,null,null,null,null,null,null,null,null,null,null,null,null,null,null,null,null,null,null,"TVL, EG 15"]
[null,null,null,null,null,null,null,null,null,null,null,null,null,null,null,null,null,null,null,null,null,null,"TVL, EG 14"]
[null,null,null,null,null,null,null,null,null,null,null,null,null,null,null,null,null,null,null,null,null,null,"TVL, EG 13 Ü"]
[null,null,null,null,null,null,null,null,null,null,null,null,null,null,null,null,null,null,null,null,null,null,"TVL, EG 13"]
[null,null,null,null,null,null,null,null,null,null,null,null,null,null,null,null,null,null,null,null,null,null,"TVL, EG 12"]
[null,null,null,null,null,null,null,null,null,null,null,null,null,null,null,null,null,null,null,null,null,null,"TVL, EG 11"]
[null,null,null,null,null,null,null,null,null,null,null,null,null,null,null,null,null,null,null,null,null,null,"TVL, EG 10"]
[null,null,null,null,null,null,null,null,null,null,null,null,null,null,null,null,null,null,null,null,null,null,"TVL, EG 9b"]
[null,null,null,null,null,null,null,null,null,null,null,null,null,null,null,null,null,null,null,null,null,null,"TVL, EG 9a"]
[null,null,null,null,null,null,null,null,null,null,null,null,null,null,null,null,null,null,null,null,null,null,"TVL, EG 8"]
[null,null,null,null,null,null,null,null,null,null,null,null,null,null,null,null,null,null,null,null,null,null,"TVL, EG 7"]
[null,null,null,null,null,null,null,null,null,null,null,null,null,null,null,null,null,null,null,null,null,null,"TVL, EG 6"]
[null,null,null,null,null,null,null,null,null,null,null,null,null,null,null,null,null,null,null,null,null,null,"TVL, EG 5"]
[null,null,null,null,null,null,null,null,null,null,null,null,null,null,null,null,null,null,null,null,null,null,"TVL, EG 4"]
[null,null,null,null,null,null,null,null,null,null,null,null,null,null,null,null,null,null,null,null,null,null,"TVL, EG 3"]
[null,null,null,null,null,null,null,null,null,null,null,null,null,null,null,null,null,null,null,null,null,null,"TVL, EG 2 Ü"]
[null,null,null,null,null,null,null,null,null,null,null,null,null,null,null,null,null,null,null,null,null,null,"TVL, EG 2"]
[null,null,null,null,null,null,null,null,null,null,null,null,null,null,null,null,null,null,null,null,null,null,"TVL, EG 1"]
[]
[null,null,null,null,null,null,null,null,null,null,null,null,null,null,null,null,null,null,null,null,null,null,"SuE TVL, S 18"]
[null,null,null,null,null,null,null,null,null,null,null,null,null,null,null,null,null,null,null,null,null,null,"SuE TVL, S 17"]
[null,null,null,null,null,null,null,null,null,null,null,null,null,null,null,null,null,null,null,null,null,null,"SuE TVL, S 16"]
[null,null,null,null,null,null,null,null,null,null,null,null,null,null,null,null,null,null,null,null,null,null,"SuE TVL, S 15"]
[null,null,null,null,null,null,null,null,null,null,null,null,null,null,null,null,null,null,null,null,null,null,"SuE TVL, S 14"]
[null,null,null,null,null,null,null,null,null,null,null,null,null,null,null,null,null,null,null,null,null,null,"SuE TVL, S 13"]
[null,null,null,null,null,null,null,null,null,null,null,null,null,null,null,null,null,null,null,null,null,null,"SuE TVL, S 12"]
[null,null,null,null,null,null,null,null,null,null,null,null,null,null,null,null,null,null,null,null,null,null,"SuE TVL, S 11b"]
[null,null,null,null,null,null,null,null,null,null,null,null,null,null,null,null,null,null,null,null,null,null,"SuE TVL, S 11a"]
[null,null,null,null,null,null,null,null,null,null,null,null,null,null,null,null,null,null,null,null,null,null,"SuE TVL, S 10"]
[null,null,null,null,null,null,null,null,null,null,null,null,null,null,null,null,null,null,null,null,null,null,"SuE TVL, S 9"]
[null,null,null,null,null,null,null,null,null,null,null,null,null,null,null,null,null,null,null,null,null,null,"SuE TVL, S 8b"]
[null,null,null,null,null,null,null,null,null,null,null,null,null,null,null,null,null,null,null,null,null,null,"SuE TVL, S 8a"]
[null,null,null,null,null,null,null,null,null,null,null,null,null,null,null,null,null,null,null,null,null,null,"SuE TVL, S 7"]
[null,null,null,null,null,null,null,null,null,null,null,null,null,null,null,null,null,null,null,null,null,null,"SuE TVL, S 4"]
[null,null,null,null,null,null,null,null,null,null,null,null,null,null,null,null,null,null,null,null,null,null,"SuE TVL, S 3"]
[null,null,null,null,null,null,null,null,null,null,null,null,null,null,null,null,null,null,null,null,null,null,"SuE TVL, S 2"]

{"sheet":"Datenausgabe","index":1,"n_rows":197,"n_cols":16,"rows_kept":197,"cut":false,"hidden":true,"merged":[]}
[2020,true,true,true,true,true,true,true,true,true,true,true,true,null,"Erststart:"]
["MonatsNr",1,2,3,4,5,6,7,8,9,10,11,12,null,true]
["Monat","Januar","Februar","März","April","Mai","Juni","Juli","August","September","Oktober","November","Dezember"]
["Tarif","KAVO nF",{"$f":"B4","v":"KAVO nF"},{"$f":"C4","v":"KAVO nF"},"KAVO nF","KAVO nF","KAVO nF","KAVO nF","KAVO nF","KAVO nF","KAVO nF","KAVO nF","KAVO nF",null,"ZuwManuell",true]
["Tarif-2","KAVO nF","KAVO nF",{"$f":"C5","v":"KAVO nF"},"KAVO nF","KAVO nF","KAVO nF","KAVO nF","KAVO nF","KAVO nF","KAVO nF","KAVO nF","KAVO nF",null,"SVManuell",false]
["Tarifgruppe","KAVO nF, EG 15 Ü",{"$f":"B6","v":"KAVO nF, EG 15 Ü"},"KAVO nF, EG 15 Ü","KAVO nF, EG 15 Ü","KAVO nF, EG 15 Ü","KAVO nF, EG 15 Ü","KAVO nF, EG 15 Ü","KAVO nF, EG 15 Ü","KAVO nF, EG 15 Ü","KAVO nF, EG 15 Ü","KAVO nF, EG 15 Ü","KAVO nF, EG 15 Ü",null,"ZVManuell",false]
["Tarifgruppe-2","KAVO nF, EG 10","KAVO nF, EG 10",{"$f":"C7","v":"KAVO nF, EG 10"},"KAVO nF, EG 10","KAVO nF, EG 10","KAVO nF, EG 10","KAVO nF, EG 10","KAVO nF, EG 10","KAVO nF, EG 10","KAVO nF, EG 10","KAVO nF, EG 10","KAVO nF, EG 10",null,"ZuwKindManuell",true]
["Tarifstufe",1,1,{"$f":"C8","v":1},1,1,1,1,1,1,1,1,1]
["Tarifstufe-2",2,2,{"$f":"C9","v":2},2,2,2,2,2,2,2,2,2]
["Indiv.Stufe",0,0,0,{"$f":"D10","v":0},0,0,0,0,0,0,0,0]
["Indiv.Stufe-2",0,0,{"$f":"C11","v":0},0,0,0,0,0,0,0,0,0]
["Pauschalverg",0,0,{"$f":"C12","v":0},0,0,0,0,0,0,0,0,0]
["Pauschalverg-2",0,0,{"$f":"C13","v":0},0,0,0,0,0,0,0,0,0]
["GBZ2 MKM",false,false,{"$f":"C14","v":false},false,false,false,false,false,false,false,false,false]
["Monatsplit",false,false,false,false,false,false,false,false,false,false,false,false]
["HT",false,false,false,false,false,false,false,false,false,false,false,false]
["Erweiterungen"]
["der"]
["Grundverütung"]
["TZ-Zähler",39,{"$f":"B20","v":39},{"$f":"C20","v":39},39,39,39,39,39,39,{"$f":"J20","v":39},39,39]
["TZ-Nenner",39,{"$f":"B21","v":39},39,39,39,39,39,39,39,39,39,39]
["Tage",31,28,31,30,31,30,31,31,30,31,30,31]
["TZ-Zähler-2",39,{"$f":"B23","v":39},{"$f":"C23","v":39},39,39,39,39,39,39,39,39,39]
["TZ-Nenner-2",39,{"$f":"B24","v":39},39,39,39,39,39,39,39,39,39,39]
["Tage-2",31,28,31,30,31,30,31,31,30,31,30,31]
["Tage Gesamt",31,28,31,30,31,30,31,31,30,31,30,31]
["ReserveZeilen"]
["für zukünftige"]
["Erweiterungen"]
["des"]
["BU"]
["Familienstand","ledig",{"$f":"B32","v":"ledig"},{"$f":"C32","v":"ledig"},"ledig","ledig","ledig","ledig","ledig","ledig","ledig","ledig","ledig"]
["Verh Höhe","voll","voll","voll","voll","voll","voll","voll","voll","voll","voll","voll","voll"]
["Verh. TZ",true,true,true,true,true,true,true,true,true,true,true,true]
[]
["Anzahl Kinder",0,0,0,0,0,0,0,0,0,0,0,0]
["Kinder TZ",true,true,true,true,true,true,true,true,true,true,true,true]
[]
[]
[]
["Konkurrenz",false,false,false,false,false,false,false,false,false,false,false,false]
["für zukünftige"]
["Erweiterungen"]
["des"]
["Familienbestandt."]
["VL Zulage",6.65,{"$f":"B46","v":6.65},6.65,6.65,6.65,6.65,6.65,6.65,6.65,6.65,6.65,6.65]
["Tarifzulage","normal",{"$f":"B47","v":"normal"},"normal","normal","normal","normal","normal","normal","normal","normal","normal","normal"]
["Name Zulage 1"]
["Name Zulage 2"]
["Name Zulage 3"]
["Name Zulage 4"]
["Betrag Zulage 1",0,{"$f":"B52","v":0},0,0,0,0,0,0,0,0,0,0]
["Betrag Zulage 2",null,{"$f":"B53","v":0},0,0,0,0,0,0,0,0,0,0]
["Betrag Zulage 3",null,{"$f":"B54","v":0},0,0,0,0,0,0,0,0,0,0]
["Betrag Zulage 4",null,{"$f":"B55","v":0},0,0,0,0,0,0,0,0,0,0]
["Klassif Zulage 1","JJJJ1J"]
["Klassif Zulage 2","JJJJ1J"]
["Klassif Zulage 3","JJJJ1J"]
["Klassif Zulage 4","JJJJ1J"]
["ReserveZeilen"]
["für zukünftige"]
["Erweiterungen"]
["des"]
["Zulagen"]
["Urlaubsgeld",false,false,false,false,false,false,false,false,false,false,false,false]
["Betrag",0,{"$f":"B66","v":0},0,0,0,0,0,0,0,0,0,0]
["Klassifizierung","JJEN1J"]
["Zuwendung",false,false,false,false,false,false,false,false,false,false,true,false]
["Zuw Prozent",77.2,{"$f":"C77","v":68.81},68.09,68.09,68.09,68.09,68.09,68.09,68.09,68.09,68.09,68.09]
["Zuw Erhöhung",0,{"$f":"B70","v":0},0,0,0,0,0,0,0,0,0,0]
["Zuw Kind",20,{"$f":"B71","v":20},20,20,20,20,20,20,20,20,20,20]
["Bem Monat 1",9,{"$f":"VLOOKUP(C4,Einstellungen!$A$2:$F$13,6,0)","v":9},{"$f":"VLOOKUP(D4,Einstellungen!$A$2:$F$13,6,0)","v":9},{"$f":"VLOOKUP(E4,Einstellungen!$A$2:$F$13,6,0)","v":9},{"$f":"VLOOKUP(F4,Einstellungen!$A$2:$F$13,6,0)","v":9},{"$f":"VLOOKUP(G4,Einstellungen!$A$2:$F$13,6,0)","v":9},{"$f":"VLOOKUP(H4,Einstellungen!$A$2:$F$13,6,0)","v":9},{"$f":"VLOOKUP(I4,Einstellungen!$A$2:$F$13,6,0)","v":9},{"$f":"VLOOKUP(J4,Einstellungen!$A$2:$F$13,6,0)","v":9},{"$f":"VLOOKUP(K4,Einstellungen!$A$2:$F$13,6,0)","v":9},{"$f":"VLOOKUP(L4,Einstellungen!$A$2:$F$13,6,0)","v":9},{"$f":"VLOOKUP(M4,Einstellungen!$A$2:$F$13,6,0)","v":9}]
["Bem Monat 2",{"$f":"IF(B72<11,B72+1,B72)","v":10},{"$f":"IF(C72<11,C72+1,C72)","v":10},10,10,10,10,10,10,10,10,10,10]
["Bem Monat 3",{"$f":"IF(B73<11,B73+1,B73)","v":11},11,11,11,11,11,11,11,11,11,11,11]
["Ber. 3 Monate",false,{"$f":"B75","v":false},false,false,false,false,false,false,false,false,false,false]
["Klassifizierung","JSEJ1J"]
["Tariif Zuw %",{"$f":"VLOOKUP(Datenausgabe!B$6,[2]!Verguetung,26,0)*100","v":68.81},{"$f":"VLOOKUP(Datenausgabe!C$6,[2]!Verguetung,26,0)*100","v":68.81},{"$f":"VLOOKUP(Datenausgabe!D$6,[3]!Verguetung,26,0)*100","v":68.09},{"$f":"VLOOKUP(Datenausgabe!E$6,[3]!Verguetung,26,0)*100","v":68.09},{"$f":"VLOOKUP(Datenausgabe!F$6,[3]!Verguetung,26,0)*100","v":68.09},{"$f":"VLOOKUP(Datenausgabe!G$6,[3]!Verguetung,26,0)*100","v":68.09},{"$f":"VLOOKUP(Datenausgabe!H$6,[3]!Verguetung,26,0)*100","v":68.09},{"$f":"VLOOKUP(Datenausgabe!I$6,[3]!Verguetung,26,0)*100","v":68.09},{"$f":"VLOOKUP(Datenausgabe!J$6,[3]!Verguetung,26,0)*100","v":68.09},{"$f":"VLOOKUP(Datenausgabe!K$6,[3]!Verguetung,26,0)*100","v":68.09},{"$f":"VLOOKUP(Datenausgabe!L$6,[3]!Verguetung,26,0)*100","v":68.09},{"$f":"VLOOKUP(Datenausgabe!M$6,[3]!Verguetung,26,0)*100","v":68.09}]
["Abweichender % Satz:",false,{"$f":"B78","v":false},false,false,false,false,false,false,false,false,false,false]
["EZ",false,{"$f":"IF(OR(Nebenrechnungen!C114>0,Nebenrechnungen!C115>0),TRUE,FALSE)","v":false},{"$f":"IF(OR(Nebenrechnungen!D114>0,Nebenrechnungen!D115>0),TRUE,FALSE)","v":false},{"$f":"IF(OR(Nebenrechnungen!E114>0,Nebenrechnungen!E115>0),TRUE,FALSE)","v":false},{"$f":"IF(OR(Nebenrechnungen!F114>0,Nebenrechnungen!F115>0),TRUE,FALSE)","v":false},{"$f":"IF(OR(Nebenrechnungen!G114>0,Nebenrechnungen!G115>0),TRUE,FALSE)","v":false},{"$f":"IF(OR(Nebenrechnungen!H114>0,Nebenrechnungen!H115>0),TRUE,FALSE)","v":false},{"$f":"IF(OR(Nebenrechnungen!I114>0,Nebenrechnungen!I115>0),TRUE,FALSE)","v":false},{"$f":"IF(OR(Nebenrechnungen!J114>0,Nebenrechnungen!J115>0),TRUE,FALSE)","v":false},{"$f":"IF(OR(Nebenrechnungen!K114>0,Nebenrechnungen!K115>0),TRUE,FALSE)","v":false},{"$f":"IF(OR(Nebenrechnungen!L114>0,Nebenrechnungen!L115>0),TRUE,FALSE)","v":false},{"$f":"IF(OR(Nebenrechnungen!M114>0,Nebenrechnungen!M115>0),TRUE,FALSE)","v":false}]
["EZ betrag",0,0,0,0,0,0,0,0,0,0,0,0]
["Ez klass","JJEJ1J"]
["Versorgung",false,{"$f":"B82","v":false},{"$f":"C82","v":false},false,false,false,false,false,false,false,false,false]
["Versorgung %",0,{"$f":"B83","v":0},0,0,0,0,0,0,0,0,0,0]
["Vers Abschlag",0,0,0,0,0,0,0,0,0,0,0,0]
["Anpassungsfaktor",0.99458000000000002,0.99458000000000002,0.99458000000000002,0.99458000000000002,0.99458000000000002,0.99458000000000002,0.99458000000000002,0.99458000000000002,0.99458000000000002,0.99458000000000002,0.99458000000000002,0.99458000000000002]
["Höhergrp MKM",false,false,false,false,false,false,false,false,false,false,false,false]
["Tarifgrp Höhergrp.","KAVO nF, EG 15 Ü",{"$f":"B87","v":"KAVO nF, EG 15 Ü"},"KAVO nF, EG 15 Ü","KAVO nF, EG 15 Ü","KAVO nF, EG 15 Ü","KAVO nF, EG 15 Ü","KAVO nF, EG 15 Ü","KAVO nF, EG 15 Ü","KAVO nF, EG 15 Ü","KAVO nF, EG 15 Ü","KAVO nF, EG 15 Ü","KAVO nF, EG 15 Ü"]
["Garantiebetrag Höhergrp.",60,60,60,60,60,60,60,60,60,60,60,60]
["Endstufe Aufstiegsgruppe",6,6,6,6,6,6,6,6,6,6,6,6]
["LEG Ob 1",true,{"$f":"B90","v":true},{"$f":"C90","v":true},true,true,true,true,true,true,true,true,false]
["LEG Ob 2",false,false,false,false,false,false,false,false,false,false,false,false]
["LEG Ob 3",false,false,false,false,false,false,false,false,false,false,false,false]
["LEG Betrag",0,{"$f":"B93","v":0},{"$f":"C93","v":0},0,0,0,0,0,0,0,0,0]
["LEG VH",24,{"$f":"B94","v":24},24,24,24,24,24,24,24,24,24,24]
["LEG Bem Monat",8,{"$f":"B95","v":8},8,8,8,8,8,8,8,8,8,8]
["Zuw Kind Tarif",{"$f":"VLOOKUP(Datenausgabe!B$6,[2]!Verguetung,27,0)","v":20},{"$f":"VLOOKUP(Datenausgabe!C$6,[2]!Verguetung,27,0)","v":20},{"$f":"VLOOKUP(Datenausgabe!D$6,[3]!Verguetung,27,0)","v":20},{"$f":"VLOOKUP(Datenausgabe!E$6,[3]!Verguetung,27,0)","v":20},{"$f":"VLOOKUP(Datenausgabe!F$6,[3]!Verguetung,27,0)","v":20},{"$f":"VLOOKUP(Datenausgabe!G$6,[3]!Verguetung,27,0)","v":20},{"$f":"VLOOKUP(Datenausgabe!H$6,[3]!Verguetung,27,0)","v":20},{"$f":"VLOOKUP(Datenausgabe!I$6,[3]!Verguetung,27,0)","v":20},{"$f":"VLOOKUP(Datenausgabe!J$6,[3]!Verguetung,27,0)","v":20},{"$f":"VLOOKUP(Datenausgabe!K$6,[3]!Verguetung,27,0)","v":20},{"$f":"VLOOKUP(Datenausgabe!L$6,[3]!Verguetung,27,0)","v":20},{"$f":"VLOOKUP(Datenausgabe!M$6,[3]!Verguetung,27,0)","v":20}]
["ReserveZeilen"]
["für zukünftige"]
["Erweiterungen"]
[]
["Steuerpflicht",true,{"$f":"B101","v":true},{"$f":"C101","v":true},true,true,true,true,true,true,true,true,true]
["Steuerklasse",1,1,{"$f":"C102","v":1},1,1,1,1,1,1,1,1,1]
["Kindeerfreibeträge",0,0,{"$f":"C103","v":0},0,0,0,0,0,0,0,0,0]
["Steuertabelle",0,0,{"$f":"C104","v":0},0,0,0,0,0,0,0,0,0]
["Geburtsjahr",1960,1960,{"$f":"C105","v":1960},{"$f":"D105","v":1960},1960,1960,1960,1960,1960,1960,1960,1960]
["Versorgungsbeginn",0,0,{"$f":"C106","v":0},0,0,0,0,0,0,0,0,0]
["Vers. Sonderz.",0,0,{"$f":"C107","v":0},0,0,0,0,0,0,0,0,0]
["STM Freib.",0,0,{"$f":"C108","v":0},0,0,0,0,0,0,0,0,0]
["STM Hinzur.",0,0,{"$f":"C109","v":0},0,0,0,0,0,0,0,0,0]
["STJ Freib.",0,0,{"$f":"C110","v":0},0,0,0,0,0,0,0,0,0]
["STJ Hinzur.",0,0,{"$f":"C111","v":0},0,0,0,0,0,0,0,0,0]
["P Lst KZVK",20,20,{"$f":"C112","v":20},20,20,20,20,20,20,20,20,20]
["P Solz KZVK",5.5,5.5,{"$f":"C113","v":5.5},5.5,5.5,5.5,5.5,5.5,5.5,5.5,5.5,5.5]
["P Kist KZVK",7,7,{"$f":"C114","v":7},7,7,7,7,7,7,7,7,7]
["P Lst Zulagen",15,15,{"$f":"C115","v":15},15,15,15,15,15,15,15,15,15]
["P Solz Zulagen",5,5,{"$f":"C116","v":5},{"$f":"D116","v":5},{"$f":"E116","v":5},5,5,5,5,5,5,5]
["P Kist Zulagen",7,7,{"$f":"C117","v":7},7,7,7,7,7,7,7,7,7]
["P Steuer AG",false,false,{"$f":"C118","v":false},false,false,false,false,false,false,false,false,false]
["Altersentlastungsbetrag",false,false,false,false,false,false,false,false,false,false,false,false]
["Faktor",0,0,{"$f":"C120","v":0},0,0,0,0,0,0,0,0,0]
[" KVPVBeitr",0,{"$f":"B121","v":0},0,0,0,0,0,0,0,0,0,0]
[" kvpfl",0,0,0,0,0,0,0,0,0,0,0,0]
["ReserveZeilen"]
["für zukünftige"]
["Erweiterungen"]
["der"]
["Steuerberechnung"]
[]
["SVPflicht",true,{"$f":"B129","v":true},{"$f":"C129","v":true},true,true,true,true,true,true,true,true,true]
["FreiwKV",false,false,{"$f":"C130","v":false},false,false,false,false,false,false,false,false,false]
["KVZuschuss",false,false,{"$f":"C131","v":false},false,false,false,false,false,false,false,false,false]
["Eltern",false,false,{"$f":"C132","v":false},false,false,false,false,false,false,false,false,false]
["KVbbg",4687.5,4687.5,4687.5,4687.5,4687.5,4687.5,{"$f":"G133","v":4687.5},4687.5,4687.5,4687.5,4687.5,4687.5]
["RVbbg",6900,6900,6900,6900,6900,{"$f":"F134","v":6900},6900,6900,6900,6900,6900,6900]
["KVpflGrenze",1,1,{"$f":"C135","v":1},1,1,1,1,1,1,1,1,1]
["U1Prozent",0,0,{"$f":"C136","v":0},0,0,0,0,0,0,0,0,0]
["U2Prozent",0.09,0.09,{"$f":"C137","v":0.09},0.09,0.09,0.09,0.09,0.09,0.09,0.09,0.09,0.09]
["KVAGProzent",7.3,7.3,{"$f":"C138","v":7.3},7.3,7.3,7.3,7.3,7.3,7.3,7.3,7.3,7.3]
["PVAGProzent",1.5249999999999999,1.5249999999999999,{"$f":"C139","v":1.5249999999999999},1.5249999999999999,1.5249999999999999,1.5249999999999999,1.5249999999999999,1.5249999999999999,1.5249999999999999,1.5249999999999999,1.5249999999999999,1.5249999999999999]
["RVAGProzent",9.3000000000000007,9.3000000000000007,{"$f":"C140","v":9.3000000000000007},9.3000000000000007,9.3000000000000007,9.3000000000000007,9.3000000000000007,9.3000000000000007,9.3000000000000007,9.3000000000000007,9.3000000000000007,9.3000000000000007]
["AVAGProzent",1.2,1.2,{"$f":"C141","v":1.2},1.2,1.2,1.2,1.2,1.2,1.2,1.2,1.2,1.2]
["KVANProzent",1.1000000000000001,1.1000000000000001,{"$f":"C142","v":1.1000000000000001},1.1000000000000001,1.1000000000000001,1.1000000000000001,1.1000000000000001,1.1000000000000001,1.1000000000000001,1.1000000000000001,1.1000000000000001,1.1000000000000001]
["PVANProzent",0.25,0.25,{"$f":"C143","v":0.25},0.25,0.25,0.25,0.25,0.25,0.25,0.25,0.25,0.25]
["RVANProzent",0,{"$f":"B144","v":0},0,0,0,0,0,0,0,0,0,0]
["AVANProzent",0,{"$f":"B145","v":0},0,0,0,0,0,0,0,0,0,0]
["KV Art",1,1,1,1,1,1,1,1,1,1,1,1]
["ReserveZeilen"]
["für zukünftige"]
["Erweiterungen"]
["der"]
["SV"]
[]
[]
[]
[]
["ZVPflicht",true,{"$f":"B156","v":true},{"$f":"C156","v":true},true,true,true,true,true,true,true,true,true]
["ZVKasse","KZVK",{"$f":"B157","v":"KZVK"},"KZVK","KZVK","KZVK","KZVK","KZVK","KZVK","KZVK","KZVK","KZVK","KZVK"]
["UmlagesAGProzent",5.6,5.6,{"$f":"C158","v":5.6},{"$f":"D158","v":5.6},{"$f":"E158","v":5.6},{"$f":"F158","v":5.6},{"$f":"G158","v":5.6},{"$f":"H158","v":5.6},{"$f":"I158","v":5.6},{"$f":"J158","v":5.6},{"$f":"K158","v":5.6},{"$f":"L158","v":5.6}]
["UmlageANProzent",0.4,0.4,{"$f":"C159","v":0.4},0.4,0.4,0.4,0.4,0.4,0.4,0.4,0.4,0.4]
["HinzurProzent",2.5,2.5,2.5,2.5,2.5,2.5,2.5,2.5,2.5,2.5,2.5,2.5]
["PauschGrenze",89.48,89.48,89.48,89.48,89.48,89.48,89.48,89.48,89.48,89.48,89.48,89.48]
["PauschFreibetrag",13.3,13.3,13.3,13.3,13.3,13.3,13.3,13.3,13.3,13.3,13.3,13.3]
["FreigrenzeEGU",4,4,4,4,4,4,4,4,4,4,4,4]
["VBLSanierungProzent",0.5,0.5,0.5,0.5,0.5,0.5,0.5,0.5,0.5,0.5,0.5,0.5]
["3 56 Frei %",2,2,2,2,2,2,2,2,2,2,2,2]
["frei SREV",100,100,100,100,100,100,100,100,100,100,100,100]
[]
["ReserveZeilen"]
["für zukünftige"]
["Erweiterungen"]
["der"]
["ZVK"]
[]
[]
["SVArt",0,{"$f":"B175","v":0},0,0,0,0,0,0,0,0,0,0]
["ErmRV",false,{"$f":"B176","v":false},false,false,false,false,false,false,false,false,false,false]
[]
["GleitFaktor F",0.75280000000000002,{"$f":"B178","v":0.75280000000000002},0.75280000000000002,0.75280000000000002,0.75280000000000002,0.75280000000000002,0.75280000000000002,0.75280000000000002,0.75280000000000002,0.75280000000000002,0.75280000000000002,0.75280000000000002]
["GleitGrenze",1300,{"$f":"B179","v":1300},1300,1300,1300,1300,1300,1300,1300,1300,1300,1300]
["GFBGrenze",450,450,450,450,450,450,450,450,450,450,450,450]
["GFBPSteuersatz",2,{"$f":"B181","v":2},2,2,2,2,2,2,2,2,2,2]
["GFBPKV",13,{"$f":"B182","v":13},13,13,13,13,13,13,13,13,13,13]
["GFBPRV",15,{"$f":"B183","v":15},15,15,15,15,15,15,15,15,15,15]
["GFBSteuerart",2,{"$f":"B184","v":2},2,2,2,2,2,2,2,2,2,2]
["GFBUmlage",false,{"$f":"B185","v":false},false,false,false,false,false,false,false,false,false,false]
["GFBAufstRV",true,{"$f":"B186","v":true},true,true,true,true,true,true,true,true,true,true]
["GFBMindBemGrdl",175,{"$f":"B187","v":175},175,175,175,175,175,175,175,175,175,175]
["ReserveZeilen",{"$f":"\"public const z\"&A188&\" = \"&ROW()","v":"public const zReserveZeilen = 188"}]
["für zukünftige"]
["Erweiterungen"]
["der"]
["GFB + Gleitz."]
["VL Gesamt",0,{"$f":"B193","v":0},0,0,0,0,0,0,0,0,0,0]
["Abzug 1 Bezeichnung",""]
["Abzugg 1 Betrag",0,0,0,0,0,0,0,0,0,0,0,0]
["Abzug 2 Bezeichnung"]
["Abzugg 2 Betrag",0,0,0,0,0,0,0,0,0,0,0,0]

{"sheet":"Nebenrechnungen","index":2,"n_rows":331,"n_cols":14,"rows_kept":331,"cut":false,"hidden":true,"merged":[]}
[null,{"$f":"Datenausgabe!B3","v":"Januar"},{"$f":"Datenausgabe!C3","v":"Februar"},{"$f":"Datenausgabe!D3","v":"März"},{"$f":"Datenausgabe!E3","v":"April"},{"$f":"Datenausgabe!F3","v":"Mai"},{"$f":"Datenausgabe!G3","v":"Juni"},{"$f":"Datenausgabe!H3","v":"Juli"},{"$f":"Datenausgabe!I3","v":"August"},{"$f":"Datenausgabe!J3","v":"September"},{"$f":"Datenausgabe!K3","v":"Oktober"},{"$f":"Datenausgabe!L3","v":"November"},{"$f":"Datenausgabe!M3","v":"Dezember"},"Erläuterungen"]
["Tabellenwerte der Vergütungsgruppen ermitteln. Wenn eine Pauschalvergütung eingegeben wurde, diese verwenden"]
["Grundgehalt 1",{"$f":"IF(Datenausgabe!B12<>0,Datenausgabe!B12,VLOOKUP(Datenausgabe!B$6,[2]!Verguetung,Datenausgabe!B$8+1,0))","v":0},{"$f":"IF(Datenausgabe!C12<>0,Datenausgabe!C12,VLOOKUP(Datenausgabe!C$6,[2]!Verguetung,Datenausgabe!C$8+1,0))","v":0},{"$f":"IF(Datenausgabe!D12<>0,Datenausgabe!D12,VLOOKUP(Datenausgabe!D$6,[3]!Verguetung,Datenausgabe!D$8+1,0))","v":0},{"$f":"IF(Datenausgabe!E12<>0,Datenausgabe!E12,VLOOKUP(Datenausgabe!E$6,[3]!Verguetung,Datenausgabe!E$8+1,0))","v":0},{"$f":"IF(Datenausgabe!F12<>0,Datenausgabe!F12,VLOOKUP(Datenausgabe!F$6,[3]!Verguetung,Datenausgabe!F$8+1,0))","v":0},{"$f":"IF(Datenausgabe!G12<>0,Datenausgabe!G12,VLOOKUP(Datenausgabe!G$6,[3]!Verguetung,Datenausgabe!G$8+1,0))","v":0},{"$f":"IF(Datenausgabe!H12<>0,Datenausgabe!H12,VLOOKUP(Datenausgabe!H$6,[3]!Verguetung,Datenausgabe!H$8+1,0))","v":0},{"$f":"IF(Datenausgabe!I12<>0,Datenausgabe!I12,VLOOKUP(Datenausgabe!I$6,[3]!Verguetung,Datenausgabe!I$8+1,0))","v":0},{"$f":"IF(Datenausgabe!J12<>0,Datenausgabe!J12,VLOOKUP(Datenausgabe!J$6,[3]!Verguetung,Datenausgabe!J$8+1,0))","v":0},{"$f":"IF(Datenausgabe!K12<>0,Datenausgabe!K12,VLOOKUP(Datenausgabe!K$6,[3]!Verguetung,Datenausgabe!K$8+1,0))","v":0},{"$f":"IF(Datenausgabe!L12<>0,Datenausgabe!L12,VLOOKUP(Datenausgabe!L$6,[3]!Verguetung,Datenausgabe!L$8+1,0))","v":0},{"$f":"IF(Datenausgabe!M12<>0,Datenausgabe!M12,VLOOKUP(Datenausgabe!M$6,[3]!Verguetung,Datenausgabe!M$8+1,0))","v":0}]
["Grundgehalt 2",{"$f":"IF(Datenausgabe!B13<>0,Datenausgabe!B13,VLOOKUP(Datenausgabe!B$7,[2]!Verguetung,Datenausgabe!B$9+1,0))","v":3613.93},{"$f":"IF(Datenausgabe!C13<>0,Datenausgabe!C13,VLOOKUP(Datenausgabe!C$7,[2]!Verguetung,Datenausgabe!C$9+1,0))","v":3613.93},{"$f":"IF(Datenausgabe!D13<>0,Datenausgabe!D13,VLOOKUP(Datenausgabe!D$7,[3]!Verguetung,Datenausgabe!D$9+1,0))","v":3655.13},{"$f":"IF(Datenausgabe!E13<>0,Datenausgabe!E13,VLOOKUP(Datenausgabe!E$7,[3]!Verguetung,Datenausgabe!E$9+1,0))","v":3655.13},{"$f":"IF(Datenausgabe!F13<>0,Datenausgabe!F13,VLOOKUP(Datenausgabe!F$7,[3]!Verguetung,Datenausgabe!F$9+1,0))","v":3655.13},{"$f":"IF(Datenausgabe!G13<>0,Datenausgabe!G13,VLOOKUP(Datenausgabe!G$7,[3]!Verguetung,Datenausgabe!G$9+1,0))","v":3655.13},{"$f":"IF(Datenausgabe!H13<>0,Datenausgabe!H13,VLOOKUP(Datenausgabe!H$7,[3]!Verguetung,Datenausgabe!H$9+1,0))","v":3655.13},{"$f":"IF(Datenausgabe!I13<>0,Datenausgabe!I13,VLOOKUP(Datenausgabe!I$7,[3]!Verguetung,Datenausgabe!I$9+1,0))","v":3655.13},{"$f":"IF(Datenausgabe!J13<>0,Datenausgabe!J13,VLOOKUP(Datenausgabe!J$7,[3]!Verguetung,Datenausgabe!J$9+1,0))","v":3655.13},{"$f":"IF(Datenausgabe!K13<>0,Datenausgabe!K13,VLOOKUP(Datenausgabe!K$7,[3]!Verguetung,Datenausgabe!K$9+1,0))","v":3655.13},{"$f":"IF(Datenausgabe!L13<>0,Datenausgabe!L13,VLOOKUP(Datenausgabe!L$7,[3]!Verguetung,Datenausgabe!L$9+1,0))","v":3655.13},{"$f":"IF(Datenausgabe!M13<>0,Datenausgabe!M13,VLOOKUP(Datenausgabe!M$7,[3]!Verguetung,Datenausgabe!M$9+1,0))","v":3655.13}]
["GG TZ Klassif:",{"$f":"VALUE(MID(Arbeitgeberkosten!$E$7,5,1))","v":1}," 1 = Teilzeit & Tage ' 2 = ungekürzt' 3 = Tage-Kürzung' 4 = Teilzeit-Kürzung"]
["HT Zulage",{"$f":"IF(AND(Datenausgabe!B16,B3>0,B4>0,B4>B3),(B4-B3)*0.5,0)*IF($B$5=1,Datenausgabe!B20/Datenausgabe!B21*Datenausgabe!B22/Datenausgabe!B26,1)*IF($B$5=2,1,1)*IF($B$5=3,Datenausgabe!B22/Datenausgabe!B26,1)*IF($B$5=4,Datenausgabe!B20/Datenausgabe!B21,1)","v":0},{"$f":"IF(AND(Datenausgabe!C16,C3>0,C4>0,C4>C3),(C4-C3)*0.5,0)*IF($B$5=1,Datenausgabe!C20/Datenausgabe!C21*Datenausgabe!C22/Datenausgabe!C26,1)*IF($B$5=2,1,1)*IF($B$5=3,Datenausgabe!C22/Datenausgabe!C26,1)*IF($B$5=4,Datenausgabe!C20/Datenausgabe!C21,1)","v":0},{"$f":"IF(AND(Datenausgabe!D16,D3>0,D4>0,D4>D3),(D4-D3)*0.5,0)*IF($B$5=1,Datenausgabe!D20/Datenausgabe!D21*Datenausgabe!D22/Datenausgabe!D26,1)*IF($B$5=2,1,1)*IF($B$5=3,Datenausgabe!D22/Datenausgabe!D26,1)*IF($B$5=4,Datenausgabe!D20/Datenausgabe!D21,1)","v":0},{"$f":"IF(AND(Datenausgabe!E16,E3>0,E4>0,E4>E3),(E4-E3)*0.5,0)*IF($B$5=1,Datenausgabe!E20/Datenausgabe!E21*Datenausgabe!E22/Datenausgabe!E26,1)*IF($B$5=2,1,1)*IF($B$5=3,Datenausgabe!E22/Datenausgabe!E26,1)*IF($B$5=4,Datenausgabe!E20/Datenausgabe!E21,1)","v":0},{"$f":"IF(AND(Datenausgabe!F16,F3>0,F4>0,F4>F3),(F4-F3)*0.5,0)*IF($B$5=1,Datenausgabe!F20/Datenausgabe!F21*Datenausgabe!F22/Datenausgabe!F26,1)*IF($B$5=2,1,1)*IF($B$5=3,Datenausgabe!F22/Datenausgabe!F26,1)*IF($B$5=4,Datenausgabe!F20/Datenausgabe!F21,1)","v":0},{"$f":"IF(AND(Datenausgabe!G16,G3>0,G4>0,G4>G3),(G4-G3)*0.5,0)*IF($B$5=1,Datenausgabe!G20/Datenausgabe!G21*Datenausgabe!G22/Datenausgabe!G26,1)*IF($B$5=2,1,1)*IF($B$5=3,Datenausgabe!G22/Datenausgabe!G26,1)*IF($B$5=4,Datenausgabe!G20/Datenausgabe!G21,1)","v":0},{"$f":"IF(AND(Datenausgabe!H16,H3>0,H4>0,H4>H3),(H4-H3)*0.5,0)*IF($B$5=1,Datenausgabe!H20/Datenausgabe!H21*Datenausgabe!H22/Datenausgabe!H26,1)*IF($B$5=2,1,1)*IF($B$5=3,Datenausgabe!H22/Datenausgabe!H26,1)*IF($B$5=4,Datenausgabe!H20/Datenausgabe!H21,1)","v":0},{"$f":"IF(AND(Datenausgabe!I16,I3>0,I4>0,I4>I3),(I4-I3)*0.5,0)*IF($B$5=1,Datenausgabe!I20/Datenausgabe!I21*Datenausgabe!I22/Datenausgabe!I26,1)*IF($B$5=2,1,1)*IF($B$5=3,Datenausgabe!I22/Datenausgabe!I26,1)*IF($B$5=4,Datenausgabe!I20/Datenausgabe!I21,1)","v":0},{"$f":"IF(AND(Datenausgabe!J16,J3>0,J4>0,J4>J3),(J4-J3)*0.5,0)*IF($B$5=1,Datenausgabe!J20/Datenausgabe!J21*Datenausgabe!J22/Datenausgabe!J26,1)*IF($B$5=2,1,1)*IF($B$5=3,Datenausgabe!J22/Datenausgabe!J26,1)*IF($B$5=4,Datenausgabe!J20/Datenausgabe!J21,1)","v":0},{"$f":"IF(AND(Datenausgabe!K16,K3>0,K4>0,K4>K3),(K4-K3)*0.5,0)*IF($B$5=1,Datenausgabe!K20/Datenausgabe!K21*Datenausgabe!K22/Datenausgabe!K26,1)*IF($B$5=2,1,1)*IF($B$5=3,Datenausgabe!K22/Datenausgabe!K26,1)*IF($B$5=4,Datenausgabe!K20/Datenausgabe!K21,1)","v":0},{"$f":"IF(AND(Datenausgabe!L16,L3>0,L4>0,L4>L3),(L4-L3)*0.5,0)*IF($B$5=1,Datenausgabe!L20/Datenausgabe!L21*Datenausgabe!L22/Datenausgabe!L26,1)*IF($B$5=2,1,1)*IF($B$5=3,Datenausgabe!L22/Datenausgabe!L26,1)*IF($B$5=4,Datenausgabe!L20/Datenausgabe!L21,1)","v":0},{"$f":"IF(AND(Datenausgabe!M16,M3>0,M4>0,M4>M3),(M4-M3)*0.5,0)*IF($B$5=1,Datenausgabe!M20/Datenausgabe!M21*Datenausgabe!M22/Datenausgabe!M26,1)*IF($B$5=2,1,1)*IF($B$5=3,Datenausgabe!M22/Datenausgabe!M26,1)*IF($B$5=4,Datenausgabe!M20/Datenausgabe!M21,1)","v":0}]
["GG 1 TZ:",{"$f":"B3*IF($B$5=1,Datenausgabe!B20/Datenausgabe!B21*Datenausgabe!B22/Datenausgabe!B26,1)*IF($B$5=2,1,1)*IF($B$5=3,Datenausgabe!B22/Datenausgabe!B26,1)*IF($B$5=4,Datenausgabe!B20/Datenausgabe!B21,1)","v":0},{"$f":"C3*IF($B$5=1,Datenausgabe!C20/Datenausgabe!C21*Datenausgabe!C22/Datenausgabe!C26,1)*IF($B$5=2,1,1)*IF($B$5=3,Datenausgabe!C22/Datenausgabe!C26,1)*IF($B$5=4,Datenausgabe!C20/Datenausgabe!C21,1)","v":0},{"$f":"D3*IF($B$5=1,Datenausgabe!D20/Datenausgabe!D21*Datenausgabe!D22/Datenausgabe!D26,1)*IF($B$5=2,1,1)*IF($B$5=3,Datenausgabe!D22/Datenausgabe!D26,1)*IF($B$5=4,Datenausgabe!D20/Datenausgabe!D21,1)","v":0},{"$f":"E3*IF($B$5=1,Datenausgabe!E20/Datenausgabe!E21*Datenausgabe!E22/Datenausgabe!E26,1)*IF($B$5=2,1,1)*IF($B$5=3,Datenausgabe!E22/Datenausgabe!E26,1)*IF($B$5=4,Datenausgabe!E20/Datenausgabe!E21,1)","v":0},{"$f":"F3*IF($B$5=1,Datenausgabe!F20/Datenausgabe!F21*Datenausgabe!F22/Datenausgabe!F26,1)*IF($B$5=2,1,1)*IF($B$5=3,Datenausgabe!F22/Datenausgabe!F26,1)*IF($B$5=4,Datenausgabe!F20/Datenausgabe!F21,1)","v":0},{"$f":"G3*IF($B$5=1,Datenausgabe!G20/Datenausgabe!G21*Datenausgabe!G22/Datenausgabe!G26,1)*IF($B$5=2,1,1)*IF($B$5=3,Datenausgabe!G22/Datenausgabe!G26,1)*IF($B$5=4,Datenausgabe!G20/Datenausgabe!G21,1)","v":0},{"$f":"H3*IF($B$5=1,Datenausgabe!H20/Datenausgabe!H21*Datenausgabe!H22/Datenausgabe!H26,1)*IF($B$5=2,1,1)*IF($B$5=3,Datenausgabe!H22/Datenausgabe!H26,1)*IF($B$5=4,Datenausgabe!H20/Datenausgabe!H21,1)","v":0},{"$f":"I3*IF($B$5=1,Datenausgabe!I20/Datenausgabe!I21*Datenausgabe!I22/Datenausgabe!I26,1)*IF($B$5=2,1,1)*IF($B$5=3,Datenausgabe!I22/Datenausgabe!I26,1)*IF($B$5=4,Datenausgabe!I20/Datenausgabe!I21,1)","v":0},{"$f":"J3*IF($B$5=1,Datenausgabe!J20/Datenausgabe!J21*Datenausgabe!J22/Datenausgabe!J26,1)*IF($B$5=2,1,1)*IF($B$5=3,Datenausgabe!J22/Datenausgabe!J26,1)*IF($B$5=4,Datenausgabe!J20/Datenausgabe!J21,1)","v":0},{"$f":"K3*IF($B$5=1,Datenausgabe!K20/Datenausgabe!K21*Datenausgabe!K22/Datenausgabe!K26,1)*IF($B$5=2,1,1)*IF($B$5=3,Datenausgabe!K22/Datenausgabe!K26,1)*IF($B$5=4,Datenausgabe!K20/Datenausgabe!K21,1)","v":0},{"$f":"L3*IF($B$5=1,Datenausgabe!L20/Datenausgabe!L21*Datenausgabe!L22/Datenausgabe!L26,1)*IF($B$5=2,1,1)*IF($B$5=3,Datenausgabe!L22/Datenausgabe!L26,1)*IF($B$5=4,Datenausgabe!L20/Datenausgabe!L21,1)","v":0},{"$f":"M3*IF($B$5=1,Datenausgabe!M20/Datenausgabe!M21*Datenausgabe!M22/Datenausgabe!M26,1)*IF($B$5=2,1,1)*IF($B$5=3,Datenausgabe!M22/Datenausgabe!M26,1)*IF($B$5=4,Datenausgabe!M20/Datenausgabe!M21,1)","v":0}]
["GG 2 TZ:",{"$f":"B4*IF($B$5=1,Datenausgabe!B23/Datenausgabe!B24*Datenausgabe!B25/Datenausgabe!B26,1)*IF($B$5=2,1,1)*IF($B$5=3,Datenausgabe!B25/Datenausgabe!B26,1)*IF($B$5=4,Datenausgabe!B23/Datenausgabe!B24,1)","v":3613.93},{"$f":"C4*IF($B$5=1,Datenausgabe!C23/Datenausgabe!C24*Datenausgabe!C25/Datenausgabe!C26,1)*IF($B$5=2,1,1)*IF($B$5=3,Datenausgabe!C25/Datenausgabe!C26,1)*IF($B$5=4,Datenausgabe!C23/Datenausgabe!C24,1)","v":3613.93},{"$f":"D4*IF($B$5=1,Datenausgabe!D23/Datenausgabe!D24*Datenausgabe!D25/Datenausgabe!D26,1)*IF($B$5=2,1,1)*IF($B$5=3,Datenausgabe!D25/Datenausgabe!D26,1)*IF($B$5=4,Datenausgabe!D23/Datenausgabe!D24,1)","v":3655.13},{"$f":"E4*IF($B$5=1,Datenausgabe!E23/Datenausgabe!E24*Datenausgabe!E25/Datenausgabe!E26,1)*IF($B$5=2,1,1)*IF($B$5=3,Datenausgabe!E25/Datenausgabe!E26,1)*IF($B$5=4,Datenausgabe!E23/Datenausgabe!E24,1)","v":3655.13},{"$f":"F4*IF($B$5=1,Datenausgabe!F23/Datenausgabe!F24*Datenausgabe!F25/Datenausgabe!F26,1)*IF($B$5=2,1,1)*IF($B$5=3,Datenausgabe!F25/Datenausgabe!F26,1)*IF($B$5=4,Datenausgabe!F23/Datenausgabe!F24,1)","v":3655.13},{"$f":"G4*IF($B$5=1,Datenausgabe!G23/Datenausgabe!G24*Datenausgabe!G25/Datenausgabe!G26,1)*IF($B$5=2,1,1)*IF($B$5=3,Datenausgabe!G25/Datenausgabe!G26,1)*IF($B$5=4,Datenausgabe!G23/Datenausgabe!G24,1)","v":3655.13},{"$f":"H4*IF($B$5=1,Datenausgabe!H23/Datenausgabe!H24*Datenausgabe!H25/Datenausgabe!H26,1)*IF($B$5=2,1,1)*IF($B$5=3,Datenausgabe!H25/Datenausgabe!H26,1)*IF($B$5=4,Datenausgabe!H23/Datenausgabe!H24,1)","v":3655.13},{"$f":"I4*IF($B$5=1,Datenausgabe!I23/Datenausgabe!I24*Datenausgabe!I25/Datenausgabe!I26,1)*IF($B$5=2,1,1)*IF($B$5=3,Datenausgabe!I25/Datenausgabe!I26,1)*IF($B$5=4,Datenausgabe!I23/Datenausgabe!I24,1)","v":3655.13},{"$f":"J4*IF($B$5=1,Datenausgabe!J23/Datenausgabe!J24*Datenausgabe!J25/Datenausgabe!J26,1)*IF($B$5=2,1,1)*IF($B$5=3,Datenausgabe!J25/Datenausgabe!J26,1)*IF($B$5=4,Datenausgabe!J23/Datenausgabe!J24,1)","v":3655.13},{"$f":"K4*IF($B$5=1,Datenausgabe!K23/Datenausgabe!K24*Datenausgabe!K25/Datenausgabe!K26,1)*IF($B$5=2,1,1)*IF($B$5=3,Datenausgabe!K25/Datenausgabe!K26,1)*IF($B$5=4,Datenausgabe!K23/Datenausgabe!K24,1)","v":3655.13},{"$f":"L4*IF($B$5=1,Datenausgabe!L23/Datenausgabe!L24*Datenausgabe!L25/Datenausgabe!L26,1)*IF($B$5=2,1,1)*IF($B$5=3,Datenausgabe!L25/Datenausgabe!L26,1)*IF($B$5=4,Datenausgabe!L23/Datenausgabe!L24,1)","v":3655.13},{"$f":"M4*IF($B$5=1,Datenausgabe!M23/Datenausgabe!M24*Datenausgabe!M25/Datenausgabe!M26,1)*IF($B$5=2,1,1)*IF($B$5=3,Datenausgabe!M25/Datenausgabe!M26,1)*IF($B$5=4,Datenausgabe!M23/Datenausgabe!M24,1)","v":3655.13}]
["Grundgehalt Gesamt:",{"$f":"IF(Datenausgabe!B1,B7+B6+IF(Datenausgabe!B14,B8,0),0)","v":0},{"$f":"IF(Datenausgabe!C1,C7+C6+IF(Datenausgabe!C14,C8,0),0)","v":0},{"$f":"IF(Datenausgabe!D1,D7+D6+IF(Datenausgabe!D14,D8,0),0)","v":0},{"$f":"IF(Datenausgabe!E1,E7+E6+IF(Datenausgabe!E14,E8,0),0)","v":0},{"$f":"IF(Datenausgabe!F1,F7+F6+IF(Datenausgabe!F14,F8,0),0)","v":0},{"$f":"IF(Datenausgabe!G1,G7+G6+IF(Datenausgabe!G14,G8,0),0)","v":0},{"$f":"IF(Datenausgabe!H1,H7+H6+IF(Datenausgabe!H14,H8,0),0)","v":0},{"$f":"IF(Datenausgabe!I1,I7+I6+IF(Datenausgabe!I14,I8,0),0)","v":0},{"$f":"IF(Datenausgabe!J1,J7+J6+IF(Datenausgabe!J14,J8,0),0)","v":0},{"$f":"IF(Datenausgabe!K1,K7+K6+IF(Datenausgabe!K14,K8,0),0)","v":0},{"$f":"IF(Datenausgabe!L1,L7+L6+IF(Datenausgabe!L14,L8,0),0)","v":0},{"$f":"IF(Datenausgabe!M1,M7+M6+IF(Datenausgabe!M14,M8,0),0)","v":0}]
["Differenz zum Tabellenentgelt ermitteln, wenn eine individuelle Stufe eingegeben wurde"]
["Differenz indiv. Stufe 1",{"$f":"IF(Datenausgabe!B10<>0,Datenausgabe!B10-B3,0)","v":0},{"$f":"IF(Datenausgabe!C10<>0,Datenausgabe!C10-C3,0)","v":0},{"$f":"IF(Datenausgabe!D10<>0,Datenausgabe!D10-D3,0)","v":0},{"$f":"IF(Datenausgabe!E10<>0,Datenausgabe!E10-E3,0)","v":0},{"$f":"IF(Datenausgabe!F10<>0,Datenausgabe!F10-F3,0)","v":0},{"$f":"IF(Datenausgabe!G10<>0,Datenausgabe!G10-G3,0)","v":0},{"$f":"IF(Datenausgabe!H10<>0,Datenausgabe!H10-H3,0)","v":0},{"$f":"IF(Datenausgabe!I10<>0,Datenausgabe!I10-I3,0)","v":0},{"$f":"IF(Datenausgabe!J10<>0,Datenausgabe!J10-J3,0)","v":0},{"$f":"IF(Datenausgabe!K10<>0,Datenausgabe!K10-K3,0)","v":0},{"$f":"IF(Datenausgabe!L10<>0,Datenausgabe!L10-L3,0)","v":0},{"$f":"IF(Datenausgabe!M10<>0,Datenausgabe!M10-M3,0)","v":0}]
["Differenz indiv. Stufe 2",{"$f":"IF(Datenausgabe!B11<>0,Datenausgabe!B11-B4,0)","v":0},{"$f":"IF(Datenausgabe!C11<>0,Datenausgabe!C11-C4,0)","v":0},{"$f":"IF(Datenausgabe!D11<>0,Datenausgabe!D11-D4,0)","v":0},{"$f":"IF(Datenausgabe!E11<>0,Datenausgabe!E11-E4,0)","v":0},{"$f":"IF(Datenausgabe!F11<>0,Datenausgabe!F11-F4,0)","v":0},{"$f":"IF(Datenausgabe!G11<>0,Datenausgabe!G11-G4,0)","v":0},{"$f":"IF(Datenausgabe!H11<>0,Datenausgabe!H11-H4,0)","v":0},{"$f":"IF(Datenausgabe!I11<>0,Datenausgabe!I11-I4,0)","v":0},{"$f":"IF(Datenausgabe!J11<>0,Datenausgabe!J11-J4,0)","v":0},{"$f":"IF(Datenausgabe!K11<>0,Datenausgabe!K11-K4,0)","v":0},{"$f":"IF(Datenausgabe!L11<>0,Datenausgabe!L11-L4,0)","v":0},{"$f":"IF(Datenausgabe!M11<>0,Datenausgabe!M11-M4,0)","v":0}]
["Indiv Stufe TZ 1",{"$f":"B11*IF($B$5=1,Datenausgabe!B20/Datenausgabe!B21*Datenausgabe!B22/Datenausgabe!B26,1)*IF($B$5=2,1,1)*IF($B$5=3,Datenausgabe!B22/Datenausgabe!B26,1)*IF($B$5=4,Datenausgabe!B20/Datenausgabe!B21,1)","v":0},{"$f":"C11*IF($B$5=1,Datenausgabe!C20/Datenausgabe!C21*Datenausgabe!C22/Datenausgabe!C26,1)*IF($B$5=2,1,1)*IF($B$5=3,Datenausgabe!C22/Datenausgabe!C26,1)*IF($B$5=4,Datenausgabe!C20/Datenausgabe!C21,1)","v":0},{"$f":"D11*IF($B$5=1,Datenausgabe!D20/Datenausgabe!D21*Datenausgabe!D22/Datenausgabe!D26,1)*IF($B$5=2,1,1)*IF($B$5=3,Datenausgabe!D22/Datenausgabe!D26,1)*IF($B$5=4,Datenausgabe!D20/Datenausgabe!D21,1)","v":0},{"$f":"E11*IF($B$5=1,Datenausgabe!E20/Datenausgabe!E21*Datenausgabe!E22/Datenausgabe!E26,1)*IF($B$5=2,1,1)*IF($B$5=3,Datenausgabe!E22/Datenausgabe!E26,1)*IF($B$5=4,Datenausgabe!E20/Datenausgabe!E21,1)","v":0},{"$f":"F11*IF($B$5=1,Datenausgabe!F20/Datenausgabe!F21*Datenausgabe!F22/Datenausgabe!F26,1)*IF($B$5=2,1,1)*IF($B$5=3,Datenausgabe!F22/Datenausgabe!F26,1)*IF($B$5=4,Datenausgabe!F20/Datenausgabe!F21,1)","v":0},{"$f":"G11*IF($B$5=1,Datenausgabe!G20/Datenausgabe!G21*Datenausgabe!G22/Datenausgabe!G26,1)*IF($B$5=2,1,1)*IF($B$5=3,Datenausgabe!G22/Datenausgabe!G26,1)*IF($B$5=4,Datenausgabe!G20/Datenausgabe!G21,1)","v":0},{"$f":"H11*IF($B$5=1,Datenausgabe!H20/Datenausgabe!H21*Datenausgabe!H22/Datenausgabe!H26,1)*IF($B$5=2,1,1)*IF($B$5=3,Datenausgabe!H22/Datenausgabe!H26,1)*IF($B$5=4,Datenausgabe!H20/Datenausgabe!H21,1)","v":0},{"$f":"I11*IF($B$5=1,Datenausgabe!I20/Datenausgabe!I21*Datenausgabe!I22/Datenausgabe!I26,1)*IF($B$5=2,1,1)*IF($B$5=3,Datenausgabe!I22/Datenausgabe!I26,1)*IF($B$5=4,Datenausgabe!I20/Datenausgabe!I21,1)","v":0},{"$f":"J11*IF($B$5=1,Datenausgabe!J20/Datenausgabe!J21*Datenausgabe!J22/Datenausgabe!J26,1)*IF($B$5=2,1,1)*IF($B$5=3,Datenausgabe!J22/Datenausgabe!J26,1)*IF($B$5=4,Datenausgabe!J20/Datenausgabe!J21,1)","v":0},{"$f":"K11*IF($B$5=1,Datenausgabe!K20/Datenausgabe!K21*Datenausgabe!K22/Datenausgabe!K26,1)*IF($B$5=2,1,1)*IF($B$5=3,Datenausgabe!K22/Datenausgabe!K26,1)*IF($B$5=4,Datenausgabe!K20/Datenausgabe!K21,1)","v":0},{"$f":"L11*IF($B$5=1,Datenausgabe!L20/Datenausgabe!L21*Datenausgabe!L22/Datenausgabe!L26,1)*IF($B$5=2,1,1)*IF($B$5=3,Datenausgabe!L22/Datenausgabe!L26,1)*IF($B$5=4,Datenausgabe!L20/Datenausgabe!L21,1)","v":0},{"$f":"M11*IF($B$5=1,Datenausgabe!M20/Datenausgabe!M21*Datenausgabe!M22/Datenausgabe!M26,1)*IF($B$5=2,1,1)*IF($B$5=3,Datenausgabe!M22/Datenausgabe!M26,1)*IF($B$5=4,Datenausgabe!M20/Datenausgabe!M21,1)","v":0}]
["Indiv Stufe TZ 2",{"$f":"B12*IF($B$5=1,Datenausgabe!B23/Datenausgabe!B24*Datenausgabe!B25/Datenausgabe!B26,1)*IF($B$5=2,1,1)*IF($B$5=3,Datenausgabe!B25/Datenausgabe!B26,1)*IF($B$5=4,Datenausgabe!B23/Datenausgabe!B24,1)","v":0},{"$f":"C12*IF($B$5=1,Datenausgabe!C23/Datenausgabe!C24*Datenausgabe!C25/Datenausgabe!C26,1)*IF($B$5=2,1,1)*IF($B$5=3,Datenausgabe!C25/Datenausgabe!C26,1)*IF($B$5=4,Datenausgabe!C23/Datenausgabe!C24,1)","v":0},{"$f":"D12*IF($B$5=1,Datenausgabe!D23/Datenausgabe!D24*Datenausgabe!D25/Datenausgabe!D26,1)*IF($B$5=2,1,1)*IF($B$5=3,Datenausgabe!D25/Datenausgabe!D26,1)*IF($B$5=4,Datenausgabe!D23/Datenausgabe!D24,1)","v":0},{"$f":"E12*IF($B$5=1,Datenausgabe!E23/Datenausgabe!E24*Datenausgabe!E25/Datenausgabe!E26,1)*IF($B$5=2,1,1)*IF($B$5=3,Datenausgabe!E25/Datenausgabe!E26,1)*IF($B$5=4,Datenausgabe!E23/Datenausgabe!E24,1)","v":0},{"$f":"F12*IF($B$5=1,Datenausgabe!F23/Datenausgabe!F24*Datenausgabe!F25/Datenausgabe!F26,1)*IF($B$5=2,1,1)*IF($B$5=3,Datenausgabe!F25/Datenausgabe!F26,1)*IF($B$5=4,Datenausgabe!F23/Datenausgabe!F24,1)","v":0},{"$f":"G12*IF($B$5=1,Datenausgabe!G23/Datenausgabe!G24*Datenausgabe!G25/Datenausgabe!G26,1)*IF($B$5=2,1,1)*IF($B$5=3,Datenausgabe!G25/Datenausgabe!G26,1)*IF($B$5=4,Datenausgabe!G23/Datenausgabe!G24,1)","v":0},{"$f":"H12*IF($B$5=1,Datenausgabe!H23/Datenausgabe!H24*Datenausgabe!H25/Datenausgabe!H26,1)*IF($B$5=2,1,1)*IF($B$5=3,Datenausgabe!H25/Datenausgabe!H26,1)*IF($B$5=4,Datenausgabe!H23/Datenausgabe!H24,1)","v":0},{"$f":"I12*IF($B$5=1,Datenausgabe!I23/Datenausgabe!I24*Datenausgabe!I25/Datenausgabe!I26,1)*IF($B$5=2,1,1)*IF($B$5=3,Datenausgabe!I25/Datenausgabe!I26,1)*IF($B$5=4,Datenausgabe!I23/Datenausgabe!I24,1)","v":0},{"$f":"J12*IF($B$5=1,Datenausgabe!J23/Datenausgabe!J24*Datenausgabe!J25/Datenausgabe!J26,1)*IF($B$5=2,1,1)*IF($B$5=3,Datenausgabe!J25/Datenausgabe!J26,1)*IF($B$5=4,Datenausgabe!J23/Datenausgabe!J24,1)","v":0},{"$f":"K12*IF($B$5=1,Datenausgabe!K23/Datenausgabe!K24*Datenausgabe!K25/Datenausgabe!K26,1)*IF($B$5=2,1,1)*IF($B$5=3,Datenausgabe!K25/Datenausgabe!K26,1)*IF($B$5=4,Datenausgabe!K23/Datenausgabe!K24,1)","v":0},{"$f":"L12*IF($B$5=1,Datenausgabe!L23/Datenausgabe!L24*Datenausgabe!L25/Datenausgabe!L26,1)*IF($B$5=2,1,1)*IF($B$5=3,Datenausgabe!L25/Datenausgabe!L26,1)*IF($B$5=4,Datenausgabe!L23/Datenausgabe!L24,1)","v":0},{"$f":"M12*IF($B$5=1,Datenausgabe!M23/Datenausgabe!M24*Datenausgabe!M25/Datenausgabe!M26,1)*IF($B$5=2,1,1)*IF($B$5=3,Datenausgabe!M25/Datenausgabe!M26,1)*IF($B$5=4,Datenausgabe!M23/Datenausgabe!M24,1)","v":0}]
["Indiv Stufe Gesamt",{"$f":"IF(Datenausgabe!B1,B13+IF(Datenausgabe!B14,B14,0),0)","v":0},{"$f":"IF(Datenausgabe!C1,C13+IF(Datenausgabe!C14,C14,0),0)","v":0},{"$f":"IF(Datenausgabe!D1,D13+IF(Datenausgabe!D14,D14,0),0)","v":0},{"$f":"IF(Datenausgabe!E1,E13+IF(Datenausgabe!E14,E14,0),0)","v":0},{"$f":"IF(Datenausgabe!F1,F13+IF(Datenausgabe!F14,F14,0),0)","v":0},{"$f":"IF(Datenausgabe!G1,G13+IF(Datenausgabe!G14,G14,0),0)","v":0},{"$f":"IF(Datenausgabe!H1,H13+IF(Datenausgabe!H14,H14,0),0)","v":0},{"$f":"IF(Datenausgabe!I1,I13+IF(Datenausgabe!I14,I14,0),0)","v":0},{"$f":"IF(Datenausgabe!J1,J13+IF(Datenausgabe!J14,J14,0),0)","v":0},{"$f":"IF(Datenausgabe!K1,K13+IF(Datenausgabe!K14,K14,0),0)","v":0},{"$f":"IF(Datenausgabe!L1,L13+IF(Datenausgabe!L14,L14,0),0)","v":0},{"$f":"IF(Datenausgabe!M1,M13+IF(Datenausgabe!M14,M14,0),0)","v":0}]
["Ermittlung der Werte für den ledigen OZ (nur wenn keine Pauschalvergütung angegeben wurde)"]
["Tabellenwert 1",{"$f":"IF(Datenausgabe!B12<>0,0,VLOOKUP(Datenausgabe!B$6,[2]!Verguetung,17,0))","v":0},{"$f":"IF(Datenausgabe!C12<>0,0,VLOOKUP(Datenausgabe!C$6,[2]!Verguetung,17,0))","v":0},{"$f":"IF(Datenausgabe!D12<>0,0,VLOOKUP(Datenausgabe!D$6,[3]!Verguetung,17,0))","v":0},{"$f":"IF(Datenausgabe!E12<>0,0,VLOOKUP(Datenausgabe!E$6,[3]!Verguetung,17,0))","v":0},{"$f":"IF(Datenausgabe!F12<>0,0,VLOOKUP(Datenausgabe!F$6,[3]!Verguetung,17,0))","v":0},{"$f":"IF(Datenausgabe!G12<>0,0,VLOOKUP(Datenausgabe!G$6,[3]!Verguetung,17,0))","v":0},{"$f":"IF(Datenausgabe!H12<>0,0,VLOOKUP(Datenausgabe!H$6,[3]!Verguetung,17,0))","v":0},{"$f":"IF(Datenausgabe!I12<>0,0,VLOOKUP(Datenausgabe!I$6,[3]!Verguetung,17,0))","v":0},{"$f":"IF(Datenausgabe!J12<>0,0,VLOOKUP(Datenausgabe!J$6,[3]!Verguetung,17,0))","v":0},{"$f":"IF(Datenausgabe!K12<>0,0,VLOOKUP(Datenausgabe!K$6,[3]!Verguetung,17,0))","v":0},{"$f":"IF(Datenausgabe!L12<>0,0,VLOOKUP(Datenausgabe!L$6,[3]!Verguetung,17,0))","v":0},{"$f":"IF(Datenausgabe!M12<>0,0,VLOOKUP(Datenausgabe!M$6,[3]!Verguetung,17,0))","v":0}]
["Tabellenwert 2",{"$f":"IF(Datenausgabe!B13<>0,0,VLOOKUP(Datenausgabe!B$7,[2]!Verguetung,17,0))","v":0},{"$f":"IF(Datenausgabe!C13<>0,0,VLOOKUP(Datenausgabe!C$7,[2]!Verguetung,17,0))","v":0},{"$f":"IF(Datenausgabe!D13<>0,0,VLOOKUP(Datenausgabe!D$7,[3]!Verguetung,17,0))","v":0},{"$f":"IF(Datenausgabe!E13<>0,0,VLOOKUP(Datenausgabe!E$7,[3]!Verguetung,17,0))","v":0},{"$f":"IF(Datenausgabe!F13<>0,0,VLOOKUP(Datenausgabe!F$7,[3]!Verguetung,17,0))","v":0},{"$f":"IF(Datenausgabe!G13<>0,0,VLOOKUP(Datenausgabe!G$7,[3]!Verguetung,17,0))","v":0},{"$f":"IF(Datenausgabe!H13<>0,0,VLOOKUP(Datenausgabe!H$7,[3]!Verguetung,17,0))","v":0},{"$f":"IF(Datenausgabe!I13<>0,0,VLOOKUP(Datenausgabe!I$7,[3]!Verguetung,17,0))","v":0},{"$f":"IF(Datenausgabe!J13<>0,0,VLOOKUP(Datenausgabe!J$7,[3]!Verguetung,17,0))","v":0},{"$f":"IF(Datenausgabe!K13<>0,0,VLOOKUP(Datenausgabe!K$7,[3]!Verguetung,17,0))","v":0},{"$f":"IF(Datenausgabe!L13<>0,0,VLOOKUP(Datenausgabe!L$7,[3]!Verguetung,17,0))","v":0},{"$f":"IF(Datenausgabe!M13<>0,0,VLOOKUP(Datenausgabe!M$7,[3]!Verguetung,17,0))","v":0}]
["ledigen OZ TZ Klassif:",{"$f":"VALUE(MID(Arbeitgeberkosten!$E$9,5,1))","v":1}," 1 = Teilzeit & Tage ' 2 = ungekürzt' 3 = Tage-Kürzung' 4 = Teilzeit-Kürzung"]
["ledigen OZ TZ 1",{"$f":"B17*IF($B$19=1,Datenausgabe!B20/Datenausgabe!B21*Datenausgabe!B22/Datenausgabe!B26,1)*IF($B$19=2,1,1)*IF($B$19=3,Datenausgabe!B22/Datenausgabe!B26,1)*IF($B$19=4,Datenausgabe!B20/Datenausgabe!B21,1)","v":0},{"$f":"C17*IF($B$19=1,Datenausgabe!C20/Datenausgabe!C21*Datenausgabe!C22/Datenausgabe!C26,1)*IF($B$19=2,1,1)*IF($B$19=3,Datenausgabe!C22/Datenausgabe!C26,1)*IF($B$19=4,Datenausgabe!C20/Datenausgabe!C21,1)","v":0},{"$f":"D17*IF($B$19=1,Datenausgabe!D20/Datenausgabe!D21*Datenausgabe!D22/Datenausgabe!D26,1)*IF($B$19=2,1,1)*IF($B$19=3,Datenausgabe!D22/Datenausgabe!D26,1)*IF($B$19=4,Datenausgabe!D20/Datenausgabe!D21,1)","v":0},{"$f":"E17*IF($B$19=1,Datenausgabe!E20/Datenausgabe!E21*Datenausgabe!E22/Datenausgabe!E26,1)*IF($B$19=2,1,1)*IF($B$19=3,Datenausgabe!E22/Datenausgabe!E26,1)*IF($B$19=4,Datenausgabe!E20/Datenausgabe!E21,1)","v":0},{"$f":"F17*IF($B$19=1,Datenausgabe!F20/Datenausgabe!F21*Datenausgabe!F22/Datenausgabe!F26,1)*IF($B$19=2,1,1)*IF($B$19=3,Datenausgabe!F22/Datenausgabe!F26,1)*IF($B$19=4,Datenausgabe!F20/Datenausgabe!F21,1)","v":0},{"$f":"G17*IF($B$19=1,Datenausgabe!G20/Datenausgabe!G21*Datenausgabe!G22/Datenausgabe!G26,1)*IF($B$19=2,1,1)*IF($B$19=3,Datenausgabe!G22/Datenausgabe!G26,1)*IF($B$19=4,Datenausgabe!G20/Datenausgabe!G21,1)","v":0},{"$f":"H17*IF($B$19=1,Datenausgabe!H20/Datenausgabe!H21*Datenausgabe!H22/Datenausgabe!H26,1)*IF($B$19=2,1,1)*IF($B$19=3,Datenausgabe!H22/Datenausgabe!H26,1)*IF($B$19=4,Datenausgabe!H20/Datenausgabe!H21,1)","v":0},{"$f":"I17*IF($B$19=1,Datenausgabe!I20/Datenausgabe!I21*Datenausgabe!I22/Datenausgabe!I26,1)*IF($B$19=2,1,1)*IF($B$19=3,Datenausgabe!I22/Datenausgabe!I26,1)*IF($B$19=4,Datenausgabe!I20/Datenausgabe!I21,1)","v":0},{"$f":"J17*IF($B$19=1,Datenausgabe!J20/Datenausgabe!J21*Datenausgabe!J22/Datenausgabe!J26,1)*IF($B$19=2,1,1)*IF($B$19=3,Datenausgabe!J22/Datenausgabe!J26,1)*IF($B$19=4,Datenausgabe!J20/Datenausgabe!J21,1)","v":0},{"$f":"K17*IF($B$19=1,Datenausgabe!K20/Datenausgabe!K21*Datenausgabe!K22/Datenausgabe!K26,1)*IF($B$19=2,1,1)*IF($B$19=3,Datenausgabe!K22/Datenausgabe!K26,1)*IF($B$19=4,Datenausgabe!K20/Datenausgabe!K21,1)","v":0},{"$f":"L17*IF($B$19=1,Datenausgabe!L20/Datenausgabe!L21*Datenausgabe!L22/Datenausgabe!L26,1)*IF($B$19=2,1,1)*IF($B$19=3,Datenausgabe!L22/Datenausgabe!L26,1)*IF($B$19=4,Datenausgabe!L20/Datenausgabe!L21,1)","v":0},{"$f":"M17*IF($B$19=1,Datenausgabe!M20/Datenausgabe!M21*Datenausgabe!M22/Datenausgabe!M26,1)*IF($B$19=2,1,1)*IF($B$19=3,Datenausgabe!M22/Datenausgabe!M26,1)*IF($B$19=4,Datenausgabe!M20/Datenausgabe!M21,1)","v":0}]
["ledigen OZ TZ 2",{"$f":"B18*IF($B$19=1,Datenausgabe!B23/Datenausgabe!B24*Datenausgabe!B25/Datenausgabe!B26,1)*IF($B$19=2,1,1)*IF($B$19=3,Datenausgabe!B25/Datenausgabe!B26,1)*IF($B$19=4,Datenausgabe!B23/Datenausgabe!B24,1)","v":0},{"$f":"C18*IF($B$19=1,Datenausgabe!C23/Datenausgabe!C24*Datenausgabe!C25/Datenausgabe!C26,1)*IF($B$19=2,1,1)*IF($B$19=3,Datenausgabe!C25/Datenausgabe!C26,1)*IF($B$19=4,Datenausgabe!C23/Datenausgabe!C24,1)","v":0},{"$f":"D18*IF($B$19=1,Datenausgabe!D23/Datenausgabe!D24*Datenausgabe!D25/Datenausgabe!D26,1)*IF($B$19=2,1,1)*IF($B$19=3,Datenausgabe!D25/Datenausgabe!D26,1)*IF($B$19=4,Datenausgabe!D23/Datenausgabe!D24,1)","v":0},{"$f":"E18*IF($B$19=1,Datenausgabe!E23/Datenausgabe!E24*Datenausgabe!E25/Datenausgabe!E26,1)*IF($B$19=2,1,1)*IF($B$19=3,Datenausgabe!E25/Datenausgabe!E26,1)*IF($B$19=4,Datenausgabe!E23/Datenausgabe!E24,1)","v":0},{"$f":"F18*IF($B$19=1,Datenausgabe!F23/Datenausgabe!F24*Datenausgabe!F25/Datenausgabe!F26,1)*IF($B$19=2,1,1)*IF($B$19=3,Datenausgabe!F25/Datenausgabe!F26,1)*IF($B$19=4,Datenausgabe!F23/Datenausgabe!F24,1)","v":0},{"$f":"G18*IF($B$19=1,Datenausgabe!G23/Datenausgabe!G24*Datenausgabe!G25/Datenausgabe!G26,1)*IF($B$19=2,1,1)*IF($B$19=3,Datenausgabe!G25/Datenausgabe!G26,1)*IF($B$19=4,Datenausgabe!G23/Datenausgabe!G24,1)","v":0},{"$f":"H18*IF($B$19=1,Datenausgabe!H23/Datenausgabe!H24*Datenausgabe!H25/Datenausgabe!H26,1)*IF($B$19=2,1,1)*IF($B$19=3,Datenausgabe!H25/Datenausgabe!H26,1)*IF($B$19=4,Datenausgabe!H23/Datenausgabe!H24,1)","v":0},{"$f":"I18*IF($B$19=1,Datenausgabe!I23/Datenausgabe!I24*Datenausgabe!I25/Datenausgabe!I26,1)*IF($B$19=2,1,1)*IF($B$19=3,Datenausgabe!I25/Datenausgabe!I26,1)*IF($B$19=4,Datenausgabe!I23/Datenausgabe!I24,1)","v":0},{"$f":"J18*IF($B$19=1,Datenausgabe!J23/Datenausgabe!J24*Datenausgabe!J25/Datenausgabe!J26,1)*IF($B$19=2,1,1)*IF($B$19=3,Datenausgabe!J25/Datenausgabe!J26,1)*IF($B$19=4,Datenausgabe!J23/Datenausgabe!J24,1)","v":0},{"$f":"K18*IF($B$19=1,Datenausgabe!K23/Datenausgabe!K24*Datenausgabe!K25/Datenausgabe!K26,1)*IF($B$19=2,1,1)*IF($B$19=3,Datenausgabe!K25/Datenausgabe!K26,1)*IF($B$19=4,Datenausgabe!K23/Datenausgabe!K24,1)","v":0},{"$f":"L18*IF($B$19=1,Datenausgabe!L23/Datenausgabe!L24*Datenausgabe!L25/Datenausgabe!L26,1)*IF($B$19=2,1,1)*IF($B$19=3,Datenausgabe!L25/Datenausgabe!L26,1)*IF($B$19=4,Datenausgabe!L23/Datenausgabe!L24,1)","v":0},{"$f":"M18*IF($B$19=1,Datenausgabe!M23/Datenausgabe!M24*Datenausgabe!M25/Datenausgabe!M26,1)*IF($B$19=2,1,1)*IF($B$19=3,Datenausgabe!M25/Datenausgabe!M26,1)*IF($B$19=4,Datenausgabe!M23/Datenausgabe!M24,1)","v":0}]
["ledigen OZ Gesamt",{"$f":"IF(Datenausgabe!B1,B20+IF(Datenausgabe!B14,B21,0),0)","v":0},{"$f":"IF(Datenausgabe!C1,C20+IF(Datenausgabe!C14,C21,0),0)","v":0},{"$f":"IF(Datenausgabe!D1,D20+IF(Datenausgabe!D14,D21,0),0)","v":0},{"$f":"IF(Datenausgabe!E1,E20+IF(Datenausgabe!E14,E21,0),0)","v":0},{"$f":"IF(Datenausgabe!F1,F20+IF(Datenausgabe!F14,F21,0),0)","v":0},{"$f":"IF(Datenausgabe!G1,G20+IF(Datenausgabe!G14,G21,0),0)","v":0},{"$f":"IF(Datenausgabe!H1,H20+IF(Datenausgabe!H14,H21,0),0)","v":0},{"$f":"IF(Datenausgabe!I1,I20+IF(Datenausgabe!I14,I21,0),0)","v":0},{"$f":"IF(Datenausgabe!J1,J20+IF(Datenausgabe!J14,J21,0),0)","v":0},{"$f":"IF(Datenausgabe!K1,K20+IF(Datenausgabe!K14,K21,0),0)","v":0},{"$f":"IF(Datenausgabe!L1,L20+IF(Datenausgabe!L14,L21,0),0)","v":0},{"$f":"IF(Datenausgabe!M1,M20+IF(Datenausgabe!M14,M21,0),0)","v":0}]
["Ermittlung der Werte für den verh. OZ (nur wenn keine Pauschalvergütung angegeben wurde)"]
["Tabellenwert 1",{"$f":"IF(Datenausgabe!B12<>0,0,VLOOKUP(Datenausgabe!B$6,[2]!Verguetung,18,0))","v":0},{"$f":"IF(Datenausgabe!C12<>0,0,VLOOKUP(Datenausgabe!C$6,[2]!Verguetung,18,0))","v":0},{"$f":"IF(Datenausgabe!D12<>0,0,VLOOKUP(Datenausgabe!D$6,[3]!Verguetung,18,0))","v":0},{"$f":"IF(Datenausgabe!E12<>0,0,VLOOKUP(Datenausgabe!E$6,[3]!Verguetung,18,0))","v":0},{"$f":"IF(Datenausgabe!F12<>0,0,VLOOKUP(Datenausgabe!F$6,[3]!Verguetung,18,0))","v":0},{"$f":"IF(Datenausgabe!G12<>0,0,VLOOKUP(Datenausgabe!G$6,[3]!Verguetung,18,0))","v":0},{"$f":"IF(Datenausgabe!H12<>0,0,VLOOKUP(Datenausgabe!H$6,[3]!Verguetung,18,0))","v":0},{"$f":"IF(Datenausgabe!I12<>0,0,VLOOKUP(Datenausgabe!I$6,[3]!Verguetung,18,0))","v":0},{"$f":"IF(Datenausgabe!J12<>0,0,VLOOKUP(Datenausgabe!J$6,[3]!Verguetung,18,0))","v":0},{"$f":"IF(Datenausgabe!K12<>0,0,VLOOKUP(Datenausgabe!K$6,[3]!Verguetung,18,0))","v":0},{"$f":"IF(Datenausgabe!L12<>0,0,VLOOKUP(Datenausgabe!L$6,[3]!Verguetung,18,0))","v":0},{"$f":"IF(Datenausgabe!M12<>0,0,VLOOKUP(Datenausgabe!M$6,[3]!Verguetung,18,0))","v":0}]
["Tabellenwert 2",{"$f":"IF(Datenausgabe!B13<>0,0,VLOOKUP(Datenausgabe!B$7,[2]!Verguetung,18,0))","v":0},{"$f":"IF(Datenausgabe!C13<>0,0,VLOOKUP(Datenausgabe!C$7,[2]!Verguetung,18,0))","v":0},{"$f":"IF(Datenausgabe!D13<>0,0,VLOOKUP(Datenausgabe!D$7,[3]!Verguetung,18,0))","v":0},{"$f":"IF(Datenausgabe!E13<>0,0,VLOOKUP(Datenausgabe!E$7,[3]!Verguetung,18,0))","v":0},{"$f":"IF(Datenausgabe!F13<>0,0,VLOOKUP(Datenausgabe!F$7,[3]!Verguetung,18,0))","v":0},{"$f":"IF(Datenausgabe!G13<>0,0,VLOOKUP(Datenausgabe!G$7,[3]!Verguetung,18,0))","v":0},{"$f":"IF(Datenausgabe!H13<>0,0,VLOOKUP(Datenausgabe!H$7,[3]!Verguetung,18,0))","v":0},{"$f":"IF(Datenausgabe!I13<>0,0,VLOOKUP(Datenausgabe!I$7,[3]!Verguetung,18,0))","v":0},{"$f":"IF(Datenausgabe!J13<>0,0,VLOOKUP(Datenausgabe!J$7,[3]!Verguetung,18,0))","v":0},{"$f":"IF(Datenausgabe!K13<>0,0,VLOOKUP(Datenausgabe!K$7,[3]!Verguetung,18,0))","v":0},{"$f":"IF(Datenausgabe!L13<>0,0,VLOOKUP(Datenausgabe!L$7,[3]!Verguetung,18,0))","v":0},{"$f":"IF(Datenausgabe!M13<>0,0,VLOOKUP(Datenausgabe!M$7,[3]!Verguetung,18,0))","v":0}]
["verh. OZ TZ Klassif:",{"$f":"VALUE(MID(Arbeitgeberkosten!$E$10,5,1))","v":1}," 1 = Teilzeit & Tage ' 2 = ungekürzt' 3 = Tage-Kürzung' 4 = Teilzeit-Kürzung"]
["Kein GBZ 2"]
["Kürzung bei Konk. - 1",{"$f":"B24*IF(Datenausgabe!B33=Einstellungen!$B$43,0,IF(Datenausgabe!B33=Einstellungen!$B$44,0.5,1))","v":0},{"$f":"C24*IF(Datenausgabe!C33=Einstellungen!$B$43,0,IF(Datenausgabe!C33=Einstellungen!$B$44,0.5,1))","v":0},{"$f":"D24*IF(Datenausgabe!D33=Einstellungen!$B$43,0,IF(Datenausgabe!D33=Einstellungen!$B$44,0.5,1))","v":0},{"$f":"E24*IF(Datenausgabe!E33=Einstellungen!$B$43,0,IF(Datenausgabe!E33=Einstellungen!$B$44,0.5,1))","v":0},{"$f":"F24*IF(Datenausgabe!F33=Einstellungen!$B$43,0,IF(Datenausgabe!F33=Einstellungen!$B$44,0.5,1))","v":0},{"$f":"G24*IF(Datenausgabe!G33=Einstellungen!$B$43,0,IF(Datenausgabe!G33=Einstellungen!$B$44,0.5,1))","v":0},{"$f":"H24*IF(Datenausgabe!H33=Einstellungen!$B$43,0,IF(Datenausgabe!H33=Einstellungen!$B$44,0.5,1))","v":0},{"$f":"I24*IF(Datenausgabe!I33=Einstellungen!$B$43,0,IF(Datenausgabe!I33=Einstellungen!$B$44,0.5,1))","v":0},{"$f":"J24*IF(Datenausgabe!J33=Einstellungen!$B$43,0,IF(Datenausgabe!J33=Einstellungen!$B$44,0.5,1))","v":0},{"$f":"K24*IF(Datenausgabe!K33=Einstellungen!$B$43,0,IF(Datenausgabe!K33=Einstellungen!$B$44,0.5,1))","v":0},{"$f":"L24*IF(Datenausgabe!L33=Einstellungen!$B$43,0,IF(Datenausgabe!L33=Einstellungen!$B$44,0.5,1))","v":0},{"$f":"M24*IF(Datenausgabe!M33=Einstellungen!$B$43,0,IF(Datenausgabe!M33=Einstellungen!$B$44,0.5,1))","v":0}]
["TZ Kürzung:",{"$f":"B28*IF($B$26=1,Datenausgabe!B20/Datenausgabe!B21*Datenausgabe!B22/Datenausgabe!B26,1)*IF($B$26=2,1,1)*IF($B$26=3,Datenausgabe!B22/Datenausgabe!B26,1)*IF($B$26=4,Datenausgabe!B20/Datenausgabe!B21,1)","v":0},{"$f":"C28*IF($B$26=1,Datenausgabe!C20/Datenausgabe!C21*Datenausgabe!C22/Datenausgabe!C26,1)*IF($B$26=2,1,1)*IF($B$26=3,Datenausgabe!C22/Datenausgabe!C26,1)*IF($B$26=4,Datenausgabe!C20/Datenausgabe!C21,1)","v":0},{"$f":"D28*IF($B$26=1,Datenausgabe!D20/Datenausgabe!D21*Datenausgabe!D22/Datenausgabe!D26,1)*IF($B$26=2,1,1)*IF($B$26=3,Datenausgabe!D22/Datenausgabe!D26,1)*IF($B$26=4,Datenausgabe!D20/Datenausgabe!D21,1)","v":0},{"$f":"E28*IF($B$26=1,Datenausgabe!E20/Datenausgabe!E21*Datenausgabe!E22/Datenausgabe!E26,1)*IF($B$26=2,1,1)*IF($B$26=3,Datenausgabe!E22/Datenausgabe!E26,1)*IF($B$26=4,Datenausgabe!E20/Datenausgabe!E21,1)","v":0},{"$f":"F28*IF($B$26=1,Datenausgabe!F20/Datenausgabe!F21*Datenausgabe!F22/Datenausgabe!F26,1)*IF($B$26=2,1,1)*IF($B$26=3,Datenausgabe!F22/Datenausgabe!F26,1)*IF($B$26=4,Datenausgabe!F20/Datenausgabe!F21,1)","v":0},{"$f":"G28*IF($B$26=1,Datenausgabe!G20/Datenausgabe!G21*Datenausgabe!G22/Datenausgabe!G26,1)*IF($B$26=2,1,1)*IF($B$26=3,Datenausgabe!G22/Datenausgabe!G26,1)*IF($B$26=4,Datenausgabe!G20/Datenausgabe!G21,1)","v":0},{"$f":"H28*IF($B$26=1,Datenausgabe!H20/Datenausgabe!H21*Datenausgabe!H22/Datenausgabe!H26,1)*IF($B$26=2,1,1)*IF($B$26=3,Datenausgabe!H22/Datenausgabe!H26,1)*IF($B$26=4,Datenausgabe!H20/Datenausgabe!H21,1)","v":0},{"$f":"I28*IF($B$26=1,Datenausgabe!I20/Datenausgabe!I21*Datenausgabe!I22/Datenausgabe!I26,1)*IF($B$26=2,1,1)*IF($B$26=3,Datenausgabe!I22/Datenausgabe!I26,1)*IF($B$26=4,Datenausgabe!I20/Datenausgabe!I21,1)","v":0},{"$f":"J28*IF($B$26=1,Datenausgabe!J20/Datenausgabe!J21*Datenausgabe!J22/Datenausgabe!J26,1)*IF($B$26=2,1,1)*IF($B$26=3,Datenausgabe!J22/Datenausgabe!J26,1)*IF($B$26=4,Datenausgabe!J20/Datenausgabe!J21,1)","v":0},{"$f":"K28*IF($B$26=1,Datenausgabe!K20/Datenausgabe!K21*Datenausgabe!K22/Datenausgabe!K26,1)*IF($B$26=2,1,1)*IF($B$26=3,Datenausgabe!K22/Datenausgabe!K26,1)*IF($B$26=4,Datenausgabe!K20/Datenausgabe!K21,1)","v":0},{"$f":"L28*IF($B$26=1,Datenausgabe!L20/Datenausgabe!L21*Datenausgabe!L22/Datenausgabe!L26,1)*IF($B$26=2,1,1)*IF($B$26=3,Datenausgabe!L22/Datenausgabe!L26,1)*IF($B$26=4,Datenausgabe!L20/Datenausgabe!L21,1)","v":0},{"$f":"M28*IF($B$26=1,Datenausgabe!M20/Datenausgabe!M21*Datenausgabe!M22/Datenausgabe!M26,1)*IF($B$26=2,1,1)*IF($B$26=3,Datenausgabe!M22/Datenausgabe!M26,1)*IF($B$26=4,Datenausgabe!M20/Datenausgabe!M21,1)","v":0}]
["verh. OZ TZ 1",{"$f":"IF(Datenausgabe!B41,B28*Datenausgabe!B22/Datenausgabe!B26,B29)","v":0},{"$f":"IF(Datenausgabe!C41,C28*Datenausgabe!C22/Datenausgabe!C26,C29)","v":0},{"$f":"IF(Datenausgabe!D41,D28*Datenausgabe!D22/Datenausgabe!D26,D29)","v":0},{"$f":"IF(Datenausgabe!E41,E28*Datenausgabe!E22/Datenausgabe!E26,E29)","v":0},{"$f":"IF(Datenausgabe!F41,F28*Datenausgabe!F22/Datenausgabe!F26,F29)","v":0},{"$f":"IF(Datenausgabe!G41,G28*Datenausgabe!G22/Datenausgabe!G26,G29)","v":0},{"$f":"IF(Datenausgabe!H41,H28*Datenausgabe!H22/Datenausgabe!H26,H29)","v":0},{"$f":"IF(Datenausgabe!I41,I28*Datenausgabe!I22/Datenausgabe!I26,I29)","v":0},{"$f":"IF(Datenausgabe!J41,J28*Datenausgabe!J22/Datenausgabe!J26,J29)","v":0},{"$f":"IF(Datenausgabe!K41,K28*Datenausgabe!K22/Datenausgabe!K26,K29)","v":0},{"$f":"IF(Datenausgabe!L41,L28*Datenausgabe!L22/Datenausgabe!L26,L29)","v":0},{"$f":"IF(Datenausgabe!M41,M28*Datenausgabe!M22/Datenausgabe!M26,M29)","v":0}]
["Höchstbetrag:",{"$f":"MAX(B32:B33)","v":0},{"$f":"MAX(C32:C33)","v":0},0,0,0,0,0,0,0,0,0,0]
["Kürzung bei Konk. - 1",{"$f":"B24*IF(Datenausgabe!B33=Einstellungen!$B$43,0,IF(Datenausgabe!B33=Einstellungen!$B$44,0.5,1))","v":0},{"$f":"C24*IF(Datenausgabe!C33=Einstellungen!$B$43,0,IF(Datenausgabe!C33=Einstellungen!$B$44,0.5,1))","v":0},{"$f":"D24*IF(Datenausgabe!D33=Einstellungen!$B$43,0,IF(Datenausgabe!D33=Einstellungen!$B$44,0.5,1))","v":0},{"$f":"E24*IF(Datenausgabe!E33=Einstellungen!$B$43,0,IF(Datenausgabe!E33=Einstellungen!$B$44,0.5,1))","v":0},{"$f":"F24*IF(Datenausgabe!F33=Einstellungen!$B$43,0,IF(Datenausgabe!F33=Einstellungen!$B$44,0.5,1))","v":0},{"$f":"G24*IF(Datenausgabe!G33=Einstellungen!$B$43,0,IF(Datenausgabe!G33=Einstellungen!$B$44,0.5,1))","v":0},{"$f":"H24*IF(Datenausgabe!H33=Einstellungen!$B$43,0,IF(Datenausgabe!H33=Einstellungen!$B$44,0.5,1))","v":0},{"$f":"I24*IF(Datenausgabe!I33=Einstellungen!$B$43,0,IF(Datenausgabe!I33=Einstellungen!$B$44,0.5,1))","v":0},{"$f":"J24*IF(Datenausgabe!J33=Einstellungen!$B$43,0,IF(Datenausgabe!J33=Einstellungen!$B$44,0.5,1))","v":0},{"$f":"K24*IF(Datenausgabe!K33=Einstellungen!$B$43,0,IF(Datenausgabe!K33=Einstellungen!$B$44,0.5,1))","v":0},{"$f":"L24*IF(Datenausgabe!L33=Einstellungen!$B$43,0,IF(Datenausgabe!L33=Einstellungen!$B$44,0.5,1))","v":0},{"$f":"M24*IF(Datenausgabe!M33=Einstellungen!$B$43,0,IF(Datenausgabe!M33=Einstellungen!$B$44,0.5,1))","v":0}]
["Kürzung bei Konk. - 2",{"$f":"B25*IF(Datenausgabe!B33=Einstellungen!$B$43,0,IF(Datenausgabe!B33=Einstellungen!$B$44,0.5,1))","v":0},{"$f":"C25*IF(Datenausgabe!C33=Einstellungen!$B$43,0,IF(Datenausgabe!C33=Einstellungen!$B$44,0.5,1))","v":0},{"$f":"D25*IF(Datenausgabe!D33=Einstellungen!$B$43,0,IF(Datenausgabe!D33=Einstellungen!$B$44,0.5,1))","v":0},{"$f":"E25*IF(Datenausgabe!E33=Einstellungen!$B$43,0,IF(Datenausgabe!E33=Einstellungen!$B$44,0.5,1))","v":0},{"$f":"F25*IF(Datenausgabe!F33=Einstellungen!$B$43,0,IF(Datenausgabe!F33=Einstellungen!$B$44,0.5,1))","v":0},{"$f":"G25*IF(Datenausgabe!G33=Einstellungen!$B$43,0,IF(Datenausgabe!G33=Einstellungen!$B$44,0.5,1))","v":0},{"$f":"H25*IF(Datenausgabe!H33=Einstellungen!$B$43,0,IF(Datenausgabe!H33=Einstellungen!$B$44,0.5,1))","v":0},{"$f":"I25*IF(Datenausgabe!I33=Einstellungen!$B$43,0,IF(Datenausgabe!I33=Einstellungen!$B$44,0.5,1))","v":0},{"$f":"J25*IF(Datenausgabe!J33=Einstellungen!$B$43,0,IF(Datenausgabe!J33=Einstellungen!$B$44,0.5,1))","v":0},{"$f":"K25*IF(Datenausgabe!K33=Einstellungen!$B$43,0,IF(Datenausgabe!K33=Einstellungen!$B$44,0.5,1))","v":0},{"$f":"L25*IF(Datenausgabe!L33=Einstellungen!$B$43,0,IF(Datenausgabe!L33=Einstellungen!$B$44,0.5,1))","v":0},{"$f":"M25*IF(Datenausgabe!M33=Einstellungen!$B$43,0,IF(Datenausgabe!M33=Einstellungen!$B$44,0.5,1))","v":0}]
["TZ Kürzung: -1",{"$f":"B32*IF($B$26=1,Datenausgabe!B20/Datenausgabe!B21*Datenausgabe!B22/Datenausgabe!B26,1)*IF($B$26=2,1,1)*IF($B$26=3,Datenausgabe!B22/Datenausgabe!B26,1)*IF($B$26=4,Datenausgabe!B20/Datenausgabe!B21,1)","v":0},{"$f":"C32*IF($B$26=1,Datenausgabe!C20/Datenausgabe!C21*Datenausgabe!C22/Datenausgabe!C26,1)*IF($B$26=2,1,1)*IF($B$26=3,Datenausgabe!C22/Datenausgabe!C26,1)*IF($B$26=4,Datenausgabe!C20/Datenausgabe!C21,1)","v":0},{"$f":"D32*IF($B$26=1,Datenausgabe!D20/Datenausgabe!D21*Datenausgabe!D22/Datenausgabe!D26,1)*IF($B$26=2,1,1)*IF($B$26=3,Datenausgabe!D22/Datenausgabe!D26,1)*IF($B$26=4,Datenausgabe!D20/Datenausgabe!D21,1)","v":0},{"$f":"E32*IF($B$26=1,Datenausgabe!E20/Datenausgabe!E21*Datenausgabe!E22/Datenausgabe!E26,1)*IF($B$26=2,1,1)*IF($B$26=3,Datenausgabe!E22/Datenausgabe!E26,1)*IF($B$26=4,Datenausgabe!E20/Datenausgabe!E21,1)","v":0},{"$f":"F32*IF($B$26=1,Datenausgabe!F20/Datenausgabe!F21*Datenausgabe!F22/Datenausgabe!F26,1)*IF($B$26=2,1,1)*IF($B$26=3,Datenausgabe!F22/Datenausgabe!F26,1)*IF($B$26=4,Datenausgabe!F20/Datenausgabe!F21,1)","v":0},{"$f":"G32*IF($B$26=1,Datenausgabe!G20/Datenausgabe!G21*Datenausgabe!G22/Datenausgabe!G26,1)*IF($B$26=2,1,1)*IF($B$26=3,Datenausgabe!G22/Datenausgabe!G26,1)*IF($B$26=4,Datenausgabe!G20/Datenausgabe!G21,1)","v":0},{"$f":"H32*IF($B$26=1,Datenausgabe!H20/Datenausgabe!H21*Datenausgabe!H22/Datenausgabe!H26,1)*IF($B$26=2,1,1)*IF($B$26=3,Datenausgabe!H22/Datenausgabe!H26,1)*IF($B$26=4,Datenausgabe!H20/Datenausgabe!H21,1)","v":0},{"$f":"I32*IF($B$26=1,Datenausgabe!I20/Datenausgabe!I21*Datenausgabe!I22/Datenausgabe!I26,1)*IF($B$26=2,1,1)*IF($B$26=3,Datenausgabe!I22/Datenausgabe!I26,1)*IF($B$26=4,Datenausgabe!I20/Datenausgabe!I21,1)","v":0},{"$f":"J32*IF($B$26=1,Datenausgabe!J20/Datenausgabe!J21*Datenausgabe!J22/Datenausgabe!J26,1)*IF($B$26=2,1,1)*IF($B$26=3,Datenausgabe!J22/Datenausgabe!J26,1)*IF($B$26=4,Datenausgabe!J20/Datenausgabe!J21,1)","v":0},{"$f":"K32*IF($B$26=1,Datenausgabe!K20/Datenausgabe!K21*Datenausgabe!K22/Datenausgabe!K26,1)*IF($B$26=2,1,1)*IF($B$26=3,Datenausgabe!K22/Datenausgabe!K26,1)*IF($B$26=4,Datenausgabe!K20/Datenausgabe!K21,1)","v":0},{"$f":"L32*IF($B$26=1,Datenausgabe!L20/Datenausgabe!L21*Datenausgabe!L22/Datenausgabe!L26,1)*IF($B$26=2,1,1)*IF($B$26=3,Datenausgabe!L22/Datenausgabe!L26,1)*IF($B$26=4,Datenausgabe!L20/Datenausgabe!L21,1)","v":0},{"$f":"M32*IF($B$26=1,Datenausgabe!M20/Datenausgabe!M21*Datenausgabe!M22/Datenausgabe!M26,1)*IF($B$26=2,1,1)*IF($B$26=3,Datenausgabe!M22/Datenausgabe!M26,1)*IF($B$26=4,Datenausgabe!M20/Datenausgabe!M21,1)","v":0}]
["TZ Kürzung: -2",{"$f":"B33*IF($B$26=1,Datenausgabe!B23/Datenausgabe!B24*Datenausgabe!B25/Datenausgabe!B26,1)*IF($B$26=2,1,1)*IF($B$26=3,Datenausgabe!B25/Datenausgabe!B26,1)*IF($B$26=4,Datenausgabe!B23/Datenausgabe!B24,1)","v":0},{"$f":"C33*IF($B$26=1,Datenausgabe!C23/Datenausgabe!C24*Datenausgabe!C25/Datenausgabe!C26,1)*IF($B$26=2,1,1)*IF($B$26=3,Datenausgabe!C25/Datenausgabe!C26,1)*IF($B$26=4,Datenausgabe!C23/Datenausgabe!C24,1)","v":0},{"$f":"D33*IF($B$26=1,Datenausgabe!D23/Datenausgabe!D24*Datenausgabe!D25/Datenausgabe!D26,1)*IF($B$26=2,1,1)*IF($B$26=3,Datenausgabe!D25/Datenausgabe!D26,1)*IF($B$26=4,Datenausgabe!D23/Datenausgabe!D24,1)","v":0},{"$f":"E33*IF($B$26=1,Datenausgabe!E23/Datenausgabe!E24*Datenausgabe!E25/Datenausgabe!E26,1)*IF($B$26=2,1,1)*IF($B$26=3,Datenausgabe!E25/Datenausgabe!E26,1)*IF($B$26=4,Datenausgabe!E23/Datenausgabe!E24,1)","v":0},{"$f":"F33*IF($B$26=1,Datenausgabe!F23/Datenausgabe!F24*Datenausgabe!F25/Datenausgabe!F26,1)*IF($B$26=2,1,1)*IF($B$26=3,Datenausgabe!F25/Datenausgabe!F26,1)*IF($B$26=4,Datenausgabe!F23/Datenausgabe!F24,1)","v":0},{"$f":"G33*IF($B$26=1,Datenausgabe!G23/Datenausgabe!G24*Datenausgabe!G25/Datenausgabe!G26,1)*IF($B$26=2,1,1)*IF($B$26=3,Datenausgabe!G25/Datenausgabe!G26,1)*IF($B$26=4,Datenausgabe!G23/Datenausgabe!G24,1)","v":0},{"$f":"H33*IF($B$26=1,Datenausgabe!H23/Datenausgabe!H24*Datenausgabe!H25/Datenausgabe!H26,1)*IF($B$26=2,1,1)*IF($B$26=3,Datenausgabe!H25/Datenausgabe!H26,1)*IF($B$26=4,Datenausgabe!H23/Datenausgabe!H24,1)","v":0},{"$f":"I33*IF($B$26=1,Datenausgabe!I23/Datenausgabe!I24*Datenausgabe!I25/Datenausgabe!I26,1)*IF($B$26=2,1,1)*IF($B$26=3,Datenausgabe!I25/Datenausgabe!I26,1)*IF($B$26=4,Datenausgabe!I23/Datenausgabe!I24,1)","v":0},{"$f":"J33*IF($B$26=1,Datenausgabe!J23/Datenausgabe!J24*Datenausgabe!J25/Datenausgabe!J26,1)*IF($B$26=2,1,1)*IF($B$26=3,Datenausgabe!J25/Datenausgabe!J26,1)*IF($B$26=4,Datenausgabe!J23/Datenausgabe!J24,1)","v":0},{"$f":"K33*IF($B$26=1,Datenausgabe!K23/Datenausgabe!K24*Datenausgabe!K25/Datenausgabe!K26,1)*IF($B$26=2,1,1)*IF($B$26=3,Datenausgabe!K25/Datenausgabe!K26,1)*IF($B$26=4,Datenausgabe!K23/Datenausgabe!K24,1)","v":0},{"$f":"L33*IF($B$26=1,Datenausgabe!L23/Datenausgabe!L24*Datenausgabe!L25/Datenausgabe!L26,1)*IF($B$26=2,1,1)*IF($B$26=3,Datenausgabe!L25/Datenausgabe!L26,1)*IF($B$26=4,Datenausgabe!L23/Datenausgabe!L24,1)","v":0},{"$f":"M33*IF($B$26=1,Datenausgabe!M23/Datenausgabe!M24*Datenausgabe!M25/Datenausgabe!M26,1)*IF($B$26=2,1,1)*IF($B$26=3,Datenausgabe!M25/Datenausgabe!M26,1)*IF($B$26=4,Datenausgabe!M23/Datenausgabe!M24,1)","v":0}]
[null,{"$f":"IF(Datenausgabe!B41,B31*IF(Datenausgabe!B15,(Datenausgabe!B22+Datenausgabe!B25)/Datenausgabe!B26,Datenausgabe!B22/Datenausgabe!B26),B34+B35)","v":0},{"$f":"IF(Datenausgabe!C41,C31*IF(Datenausgabe!C15,(Datenausgabe!C22+Datenausgabe!C25)/Datenausgabe!C26,Datenausgabe!C22/Datenausgabe!C26),C34+C35)","v":0},{"$f":"IF(Datenausgabe!D41,D31*IF(Datenausgabe!D15,(Datenausgabe!D22+Datenausgabe!D25)/Datenausgabe!D26,Datenausgabe!D22/Datenausgabe!D26),D34+D35)","v":0},{"$f":"IF(Datenausgabe!E41,E31*IF(Datenausgabe!E15,(Datenausgabe!E22+Datenausgabe!E25)/Datenausgabe!E26,Datenausgabe!E22/Datenausgabe!E26),E34+E35)","v":0},{"$f":"IF(Datenausgabe!F41,F31*IF(Datenausgabe!F15,(Datenausgabe!F22+Datenausgabe!F25)/Datenausgabe!F26,Datenausgabe!F22/Datenausgabe!F26),F34+F35)","v":0},{"$f":"IF(Datenausgabe!G41,G31*IF(Datenausgabe!G15,(Datenausgabe!G22+Datenausgabe!G25)/Datenausgabe!G26,Datenausgabe!G22/Datenausgabe!G26),G34+G35)","v":0},{"$f":"IF(Datenausgabe!H41,H31*IF(Datenausgabe!H15,(Datenausgabe!H22+Datenausgabe!H25)/Datenausgabe!H26,Datenausgabe!H22/Datenausgabe!H26),H34+H35)","v":0},{"$f":"IF(Datenausgabe!I41,I31*IF(Datenausgabe!I15,(Datenausgabe!I22+Datenausgabe!I25)/Datenausgabe!I26,Datenausgabe!I22/Datenausgabe!I26),I34+I35)","v":0},{"$f":"IF(Datenausgabe!J41,J31*IF(Datenausgabe!J15,(Datenausgabe!J22+Datenausgabe!J25)/Datenausgabe!J26,Datenausgabe!J22/Datenausgabe!J26),J34+J35)","v":0},{"$f":"IF(Datenausgabe!K41,K31*IF(Datenausgabe!K15,(Datenausgabe!K22+Datenausgabe!K25)/Datenausgabe!K26,Datenausgabe!K22/Datenausgabe!K26),K34+K35)","v":0},{"$f":"IF(Datenausgabe!L41,L31*IF(Datenausgabe!L15,(Datenausgabe!L22+Datenausgabe!L25)/Datenausgabe!L26,Datenausgabe!L22/Datenausgabe!L26),L34+L35)","v":0},{"$f":"IF(Datenausgabe!M41,M31*IF(Datenausgabe!M15,(Datenausgabe!M22+Datenausgabe!M25)/Datenausgabe!M26,Datenausgabe!M22/Datenausgabe!M26),M34+M35)","v":0}]
["verh. OZ Gesamt",{"$f":"IF(Datenausgabe!B1,IF(Datenausgabe!B14,B36,B30),0)","v":0},{"$f":"IF(Datenausgabe!C1,IF(Datenausgabe!C14,C36,C30),0)","v":0},{"$f":"IF(Datenausgabe!D1,IF(Datenausgabe!D14,D36,D30),0)","v":0},{"$f":"IF(Datenausgabe!E1,IF(Datenausgabe!E14,E36,E30),0)","v":0},{"$f":"IF(Datenausgabe!F1,IF(Datenausgabe!F14,F36,F30),0)","v":0},{"$f":"IF(Datenausgabe!G1,IF(Datenausgabe!G14,G36,G30),0)","v":0},{"$f":"IF(Datenausgabe!H1,IF(Datenausgabe!H14,H36,H30),0)","v":0},{"$f":"IF(Datenausgabe!I1,IF(Datenausgabe!I14,I36,I30),0)","v":0},{"$f":"IF(Datenausgabe!J1,IF(Datenausgabe!J14,J36,J30),0)","v":0},{"$f":"IF(Datenausgabe!K1,IF(Datenausgabe!K14,K36,K30),0)","v":0},{"$f":"IF(Datenausgabe!L1,IF(Datenausgabe!L14,L36,L30),0)","v":0},{"$f":"IF(Datenausgabe!M1,IF(Datenausgabe!M14,M36,M30),0)","v":0}]
["Ermittlung der Werte für den Kinder OZ (nur wenn keine Pauschalvergütung angegeben wurde)"]
["Tabellenwert Kind 1 & 2 GBZ 1",{"$f":"IF(Datenausgabe!B12<>0,0,VLOOKUP(Datenausgabe!B$6,[2]!Verguetung,19,0))","v":0},{"$f":"IF(Datenausgabe!C12<>0,0,VLOOKUP(Datenausgabe!C$6,[2]!Verguetung,19,0))","v":0},{"$f":"IF(Datenausgabe!D12<>0,0,VLOOKUP(Datenausgabe!D$6,[3]!Verguetung,19,0))","v":0},{"$f":"IF(Datenausgabe!E12<>0,0,VLOOKUP(Datenausgabe!E$6,[3]!Verguetung,19,0))","v":0},{"$f":"IF(Datenausgabe!F12<>0,0,VLOOKUP(Datenausgabe!F$6,[3]!Verguetung,19,0))","v":0},{"$f":"IF(Datenausgabe!G12<>0,0,VLOOKUP(Datenausgabe!G$6,[3]!Verguetung,19,0))","v":0},{"$f":"IF(Datenausgabe!H12<>0,0,VLOOKUP(Datenausgabe!H$6,[3]!Verguetung,19,0))","v":0},{"$f":"IF(Datenausgabe!I12<>0,0,VLOOKUP(Datenausgabe!I$6,[3]!Verguetung,19,0))","v":0},{"$f":"IF(Datenausgabe!J12<>0,0,VLOOKUP(Datenausgabe!J$6,[3]!Verguetung,19,0))","v":0},{"$f":"IF(Datenausgabe!K12<>0,0,VLOOKUP(Datenausgabe!K$6,[3]!Verguetung,19,0))","v":0},{"$f":"IF(Datenausgabe!L12<>0,0,VLOOKUP(Datenausgabe!L$6,[3]!Verguetung,19,0))","v":0},{"$f":"IF(Datenausgabe!M12<>0,0,VLOOKUP(Datenausgabe!M$6,[3]!Verguetung,19,0))","v":0}]
["Tabellenwert ab Kind 3 GBZ 1",{"$f":"IF(Datenausgabe!B12<>0,0,VLOOKUP(Datenausgabe!B$6,[2]!Verguetung,22,0))","v":0},{"$f":"IF(Datenausgabe!C12<>0,0,VLOOKUP(Datenausgabe!C$6,[2]!Verguetung,22,0))","v":0},{"$f":"IF(Datenausgabe!D12<>0,0,VLOOKUP(Datenausgabe!D$6,[3]!Verguetung,22,0))","v":0},{"$f":"IF(Datenausgabe!E12<>0,0,VLOOKUP(Datenausgabe!E$6,[3]!Verguetung,22,0))","v":0},{"$f":"IF(Datenausgabe!F12<>0,0,VLOOKUP(Datenausgabe!F$6,[3]!Verguetung,22,0))","v":0},{"$f":"IF(Datenausgabe!G12<>0,0,VLOOKUP(Datenausgabe!G$6,[3]!Verguetung,22,0))","v":0},{"$f":"IF(Datenausgabe!H12<>0,0,VLOOKUP(Datenausgabe!H$6,[3]!Verguetung,22,0))","v":0},{"$f":"IF(Datenausgabe!I12<>0,0,VLOOKUP(Datenausgabe!I$6,[3]!Verguetung,22,0))","v":0},{"$f":"IF(Datenausgabe!J12<>0,0,VLOOKUP(Datenausgabe!J$6,[3]!Verguetung,22,0))","v":0},{"$f":"IF(Datenausgabe!K12<>0,0,VLOOKUP(Datenausgabe!K$6,[3]!Verguetung,22,0))","v":0},{"$f":"IF(Datenausgabe!L12<>0,0,VLOOKUP(Datenausgabe!L$6,[3]!Verguetung,22,0))","v":0},{"$f":"IF(Datenausgabe!M12<>0,0,VLOOKUP(Datenausgabe!M$6,[3]!Verguetung,22,0))","v":0}]
["Tabellenwert Kind 1 & 2 GBZ 2",{"$f":"IF(Datenausgabe!B13<>0,0,VLOOKUP(Datenausgabe!B$7,[2]!Verguetung,19,0))","v":0},{"$f":"IF(Datenausgabe!C13<>0,0,VLOOKUP(Datenausgabe!C$7,[2]!Verguetung,19,0))","v":0},{"$f":"IF(Datenausgabe!D13<>0,0,VLOOKUP(Datenausgabe!D$7,[3]!Verguetung,19,0))","v":0},{"$f":"IF(Datenausgabe!E13<>0,0,VLOOKUP(Datenausgabe!E$7,[3]!Verguetung,19,0))","v":0},{"$f":"IF(Datenausgabe!F13<>0,0,VLOOKUP(Datenausgabe!F$7,[3]!Verguetung,19,0))","v":0},{"$f":"IF(Datenausgabe!G13<>0,0,VLOOKUP(Datenausgabe!G$7,[3]!Verguetung,19,0))","v":0},{"$f":"IF(Datenausgabe!H13<>0,0,VLOOKUP(Datenausgabe!H$7,[3]!Verguetung,19,0))","v":0},{"$f":"IF(Datenausgabe!I13<>0,0,VLOOKUP(Datenausgabe!I$7,[3]!Verguetung,19,0))","v":0},{"$f":"IF(Datenausgabe!J13<>0,0,VLOOKUP(Datenausgabe!J$7,[3]!Verguetung,19,0))","v":0},{"$f":"IF(Datenausgabe!K13<>0,0,VLOOKUP(Datenausgabe!K$7,[3]!Verguetung,19,0))","v":0},{"$f":"IF(Datenausgabe!L13<>0,0,VLOOKUP(Datenausgabe!L$7,[3]!Verguetung,19,0))","v":0},{"$f":"IF(Datenausgabe!M13<>0,0,VLOOKUP(Datenausgabe!M$7,[3]!Verguetung,19,0))","v":0}]
["Tabellenwert ab Kind 3 GBZ 2",{"$f":"IF(Datenausgabe!B13<>0,0,VLOOKUP(Datenausgabe!B$7,[2]!Verguetung,22,0))","v":0},{"$f":"IF(Datenausgabe!C13<>0,0,VLOOKUP(Datenausgabe!C$7,[2]!Verguetung,22,0))","v":0},{"$f":"IF(Datenausgabe!D13<>0,0,VLOOKUP(Datenausgabe!D$7,[3]!Verguetung,22,0))","v":0},{"$f":"IF(Datenausgabe!E13<>0,0,VLOOKUP(Datenausgabe!E$7,[3]!Verguetung,22,0))","v":0},{"$f":"IF(Datenausgabe!F13<>0,0,VLOOKUP(Datenausgabe!F$7,[3]!Verguetung,22,0))","v":0},{"$f":"IF(Datenausgabe!G13<>0,0,VLOOKUP(Datenausgabe!G$7,[3]!Verguetung,22,0))","v":0},{"$f":"IF(Datenausgabe!H13<>0,0,VLOOKUP(Datenausgabe!H$7,[3]!Verguetung,22,0))","v":0},{"$f":"IF(Datenausgabe!I13<>0,0,VLOOKUP(Datenausgabe!I$7,[3]!Verguetung,22,0))","v":0},{"$f":"IF(Datenausgabe!J13<>0,0,VLOOKUP(Datenausgabe!J$7,[3]!Verguetung,22,0))","v":0},{"$f":"IF(Datenausgabe!K13<>0,0,VLOOKUP(Datenausgabe!K$7,[3]!Verguetung,22,0))","v":0},{"$f":"IF(Datenausgabe!L13<>0,0,VLOOKUP(Datenausgabe!L$7,[3]!Verguetung,22,0))","v":0},{"$f":"IF(Datenausgabe!M13<>0,0,VLOOKUP(Datenausgabe!M$7,[3]!Verguetung,22,0))","v":0}]
["Kind OZ TZ Klassif:",{"$f":"VALUE(MID(Arbeitgeberkosten!$E$11,5,1))","v":1}," 1 = Teilzeit & Tage ' 2 = ungekürzt' 3 = Tage-Kürzung' 4 = Teilzeit-Kürzung"]
["Summe für alle Kinder, GBZ 1",{"$f":"IF(Datenausgabe!B36<=2,Datenausgabe!B36*B39,2*B39+(Datenausgabe!B36-2)*B40)","v":0},{"$f":"IF(Datenausgabe!C36<=2,Datenausgabe!C36*C39,2*C39+(Datenausgabe!C36-2)*C40)","v":0},{"$f":"IF(Datenausgabe!D36<=2,Datenausgabe!D36*D39,2*D39+(Datenausgabe!D36-2)*D40)","v":0},{"$f":"IF(Datenausgabe!E36<=2,Datenausgabe!E36*E39,2*E39+(Datenausgabe!E36-2)*E40)","v":0},{"$f":"IF(Datenausgabe!F36<=2,Datenausgabe!F36*F39,2*F39+(Datenausgabe!F36-2)*F40)","v":0},{"$f":"IF(Datenausgabe!G36<=2,Datenausgabe!G36*G39,2*G39+(Datenausgabe!G36-2)*G40)","v":0},{"$f":"IF(Datenausgabe!H36<=2,Datenausgabe!H36*H39,2*H39+(Datenausgabe!H36-2)*H40)","v":0},{"$f":"IF(Datenausgabe!I36<=2,Datenausgabe!I36*I39,2*I39+(Datenausgabe!I36-2)*I40)","v":0},{"$f":"IF(Datenausgabe!J36<=2,Datenausgabe!J36*J39,2*J39+(Datenausgabe!J36-2)*J40)","v":0},{"$f":"IF(Datenausgabe!K36<=2,Datenausgabe!K36*K39,2*K39+(Datenausgabe!K36-2)*K40)","v":0},{"$f":"IF(Datenausgabe!L36<=2,Datenausgabe!L36*L39,2*L39+(Datenausgabe!L36-2)*L40)","v":0},{"$f":"IF(Datenausgabe!M36<=2,Datenausgabe!M36*M39,2*M39+(Datenausgabe!M36-2)*M40)","v":0}]
["Summe für alle Kinder, GBZ 2",{"$f":"IF(Datenausgabe!B36<=2,Datenausgabe!B36*B41,2*B41+(Datenausgabe!B36-2)*B42)","v":0},{"$f":"IF(Datenausgabe!C36<=2,Datenausgabe!C36*C41,2*C41+(Datenausgabe!C36-2)*C42)","v":0},{"$f":"IF(Datenausgabe!D36<=2,Datenausgabe!D36*D41,2*D41+(Datenausgabe!D36-2)*D42)","v":0},{"$f":"IF(Datenausgabe!E36<=2,Datenausgabe!E36*E41,2*E41+(Datenausgabe!E36-2)*E42)","v":0},{"$f":"IF(Datenausgabe!F36<=2,Datenausgabe!F36*F41,2*F41+(Datenausgabe!F36-2)*F42)","v":0},{"$f":"IF(Datenausgabe!G36<=2,Datenausgabe!G36*G41,2*G41+(Datenausgabe!G36-2)*G42)","v":0},{"$f":"IF(Datenausgabe!H36<=2,Datenausgabe!H36*H41,2*H41+(Datenausgabe!H36-2)*H42)","v":0},{"$f":"IF(Datenausgabe!I36<=2,Datenausgabe!I36*I41,2*I41+(Datenausgabe!I36-2)*I42)","v":0},{"$f":"IF(Datenausgabe!J36<=2,Datenausgabe!J36*J41,2*J41+(Datenausgabe!J36-2)*J42)","v":0},{"$f":"IF(Datenausgabe!K36<=2,Datenausgabe!K36*K41,2*K41+(Datenausgabe!K36-2)*K42)","v":0},{"$f":"IF(Datenausgabe!L36<=2,Datenausgabe!L36*L41,2*L41+(Datenausgabe!L36-2)*L42)","v":0},{"$f":"IF(Datenausgabe!M36<=2,Datenausgabe!M36*M41,2*M41+(Datenausgabe!M36-2)*M42)","v":0}]
["Kein GBZ 2"]
["TZ Kürzung:",{"$f":"B44*IF($B$43=1,Datenausgabe!B20/Datenausgabe!B21*Datenausgabe!B22/Datenausgabe!B26,1)*IF($B$43=2,1,1)*IF($B$43=3,Datenausgabe!B22/Datenausgabe!B26,1)*IF($B$43=4,Datenausgabe!B20/Datenausgabe!B21,1)","v":0},{"$f":"C44*IF($B$43=1,Datenausgabe!C20/Datenausgabe!C21*Datenausgabe!C22/Datenausgabe!C26,1)*IF($B$43=2,1,1)*IF($B$43=3,Datenausgabe!C22/Datenausgabe!C26,1)*IF($B$43=4,Datenausgabe!C20/Datenausgabe!C21,1)","v":0},{"$f":"D44*IF($B$43=1,Datenausgabe!D20/Datenausgabe!D21*Datenausgabe!D22/Datenausgabe!D26,1)*IF($B$43=2,1,1)*IF($B$43=3,Datenausgabe!D22/Datenausgabe!D26,1)*IF($B$43=4,Datenausgabe!D20/Datenausgabe!D21,1)","v":0},{"$f":"E44*IF($B$43=1,Datenausgabe!E20/Datenausgabe!E21*Datenausgabe!E22/Datenausgabe!E26,1)*IF($B$43=2,1,1)*IF($B$43=3,Datenausgabe!E22/Datenausgabe!E26,1)*IF($B$43=4,Datenausgabe!E20/Datenausgabe!E21,1)","v":0},{"$f":"F44*IF($B$43=1,Datenausgabe!F20/Datenausgabe!F21*Datenausgabe!F22/Datenausgabe!F26,1)*IF($B$43=2,1,1)*IF($B$43=3,Datenausgabe!F22/Datenausgabe!F26,1)*IF($B$43=4,Datenausgabe!F20/Datenausgabe!F21,1)","v":0},{"$f":"G44*IF($B$43=1,Datenausgabe!G20/Datenausgabe!G21*Datenausgabe!G22/Datenausgabe!G26,1)*IF($B$43=2,1,1)*IF($B$43=3,Datenausgabe!G22/Datenausgabe!G26,1)*IF($B$43=4,Datenausgabe!G20/Datenausgabe!G21,1)","v":0},{"$f":"H44*IF($B$43=1,Datenausgabe!H20/Datenausgabe!H21*Datenausgabe!H22/Datenausgabe!H26,1)*IF($B$43=2,1,1)*IF($B$43=3,Datenausgabe!H22/Datenausgabe!H26,1)*IF($B$43=4,Datenausgabe!H20/Datenausgabe!H21,1)","v":0},{"$f":"I44*IF($B$43=1,Datenausgabe!I20/Datenausgabe!I21*Datenausgabe!I22/Datenausgabe!I26,1)*IF($B$43=2,1,1)*IF($B$43=3,Datenausgabe!I22/Datenausgabe!I26,1)*IF($B$43=4,Datenausgabe!I20/Datenausgabe!I21,1)","v":0},{"$f":"J44*IF($B$43=1,Datenausgabe!J20/Datenausgabe!J21*Datenausgabe!J22/Datenausgabe!J26,1)*IF($B$43=2,1,1)*IF($B$43=3,Datenausgabe!J22/Datenausgabe!J26,1)*IF($B$43=4,Datenausgabe!J20/Datenausgabe!J21,1)","v":0},{"$f":"K44*IF($B$43=1,Datenausgabe!K20/Datenausgabe!K21*Datenausgabe!K22/Datenausgabe!K26,1)*IF($B$43=2,1,1)*IF($B$43=3,Datenausgabe!K22/Datenausgabe!K26,1)*IF($B$43=4,Datenausgabe!K20/Datenausgabe!K21,1)","v":0},{"$f":"L44*IF($B$43=1,Datenausgabe!L20/Datenausgabe!L21*Datenausgabe!L22/Datenausgabe!L26,1)*IF($B$43=2,1,1)*IF($B$43=3,Datenausgabe!L22/Datenausgabe!L26,1)*IF($B$43=4,Datenausgabe!L20/Datenausgabe!L21,1)","v":0},{"$f":"M44*IF($B$43=1,Datenausgabe!M20/Datenausgabe!M21*Datenausgabe!M22/Datenausgabe!M26,1)*IF($B$43=2,1,1)*IF($B$43=3,Datenausgabe!M22/Datenausgabe!M26,1)*IF($B$43=4,Datenausgabe!M20/Datenausgabe!M21,1)","v":0}]
["Kind OZ ",{"$f":"IF(Datenausgabe!B41,B44*Datenausgabe!B22/Datenausgabe!B26,B47)","v":0},{"$f":"IF(Datenausgabe!C41,C44*Datenausgabe!C22/Datenausgabe!C26,C47)","v":0},{"$f":"IF(Datenausgabe!D41,D44*Datenausgabe!D22/Datenausgabe!D26,D47)","v":0},{"$f":"IF(Datenausgabe!E41,E44*Datenausgabe!E22/Datenausgabe!E26,E47)","v":0},{"$f":"IF(Datenausgabe!F41,F44*Datenausgabe!F22/Datenausgabe!F26,F47)","v":0},{"$f":"IF(Datenausgabe!G41,G44*Datenausgabe!G22/Datenausgabe!G26,G47)","v":0},{"$f":"IF(Datenausgabe!H41,H44*Datenausgabe!H22/Datenausgabe!H26,H47)","v":0},{"$f":"IF(Datenausgabe!I41,I44*Datenausgabe!I22/Datenausgabe!I26,I47)","v":0},{"$f":"IF(Datenausgabe!J41,J44*Datenausgabe!J22/Datenausgabe!J26,J47)","v":0},{"$f":"IF(Datenausgabe!K41,K44*Datenausgabe!K22/Datenausgabe!K26,K47)","v":0},{"$f":"IF(Datenausgabe!L41,L44*Datenausgabe!L22/Datenausgabe!L26,L47)","v":0},{"$f":"IF(Datenausgabe!M41,M44*Datenausgabe!M22/Datenausgabe!M26,M47)","v":0}]
["mit GBZ 2"]
["Höchstbetrag:",{"$f":"MAX(B44:B45)","v":0},{"$f":"MAX(C44:C45)","v":0},0,0,0,0,0,0,0,0,0,0]
["TZ Kürzung: - 1",{"$f":"B44*IF($B$43=1,Datenausgabe!B20/Datenausgabe!B21*Datenausgabe!B22/Datenausgabe!B26,1)*IF($B$43=2,1,1)*IF($B$43=3,Datenausgabe!B22/Datenausgabe!B26,1)*IF($B$43=4,Datenausgabe!B20/Datenausgabe!B21,1)","v":0},{"$f":"C44*IF($B$43=1,Datenausgabe!C20/Datenausgabe!C21*Datenausgabe!C22/Datenausgabe!C26,1)*IF($B$43=2,1,1)*IF($B$43=3,Datenausgabe!C22/Datenausgabe!C26,1)*IF($B$43=4,Datenausgabe!C20/Datenausgabe!C21,1)","v":0},{"$f":"D44*IF($B$43=1,Datenausgabe!D20/Datenausgabe!D21*Datenausgabe!D22/Datenausgabe!D26,1)*IF($B$43=2,1,1)*IF($B$43=3,Datenausgabe!D22/Datenausgabe!D26,1)*IF($B$43=4,Datenausgabe!D20/Datenausgabe!D21,1)","v":0},{"$f":"E44*IF($B$43=1,Datenausgabe!E20/Datenausgabe!E21*Datenausgabe!E22/Datenausgabe!E26,1)*IF($B$43=2,1,1)*IF($B$43=3,Datenausgabe!E22/Datenausgabe!E26,1)*IF($B$43=4,Datenausgabe!E20/Datenausgabe!E21,1)","v":0},{"$f":"F44*IF($B$43=1,Datenausgabe!F20/Datenausgabe!F21*Datenausgabe!F22/Datenausgabe!F26,1)*IF($B$43=2,1,1)*IF($B$43=3,Datenausgabe!F22/Datenausgabe!F26,1)*IF($B$43=4,Datenausgabe!F20/Datenausgabe!F21,1)","v":0},{"$f":"G44*IF($B$43=1,Datenausgabe!G20/Datenausgabe!G21*Datenausgabe!G22/Datenausgabe!G26,1)*IF($B$43=2,1,1)*IF($B$43=3,Datenausgabe!G22/Datenausgabe!G26,1)*IF($B$43=4,Datenausgabe!G20/Datenausgabe!G21,1)","v":0},{"$f":"H44*IF($B$43=1,Datenausgabe!H20/Datenausgabe!H21*Datenausgabe!H22/Datenausgabe!H26,1)*IF($B$43=2,1,1)*IF($B$43=3,Datenausgabe!H22/Datenausgabe!H26,1)*IF($B$43=4,Datenausgabe!H20/Datenausgabe!H21,1)","v":0},{"$f":"I44*IF($B$43=1,Datenausgabe!I20/Datenausgabe!I21*Datenausgabe!I22/Datenausgabe!I26,1)*IF($B$43=2,1,1)*IF($B$43=3,Datenausgabe!I22/Datenausgabe!I26,1)*IF($B$43=4,Datenausgabe!I20/Datenausgabe!I21,1)","v":0},{"$f":"J44*IF($B$43=1,Datenausgabe!J20/Datenausgabe!J21*Datenausgabe!J22/Datenausgabe!J26,1)*IF($B$43=2,1,1)*IF($B$43=3,Datenausgabe!J22/Datenausgabe!J26,1)*IF($B$43=4,Datenausgabe!J20/Datenausgabe!J21,1)","v":0},{"$f":"K44*IF($B$43=1,Datenausgabe!K20/Datenausgabe!K21*Datenausgabe!K22/Datenausgabe!K26,1)*IF($B$43=2,1,1)*IF($B$43=3,Datenausgabe!K22/Datenausgabe!K26,1)*IF($B$43=4,Datenausgabe!K20/Datenausgabe!K21,1)","v":0},{"$f":"L44*IF($B$43=1,Datenausgabe!L20/Datenausgabe!L21*Datenausgabe!L22/Datenausgabe!L26,1)*IF($B$43=2,1,1)*IF($B$43=3,Datenausgabe!L22/Datenausgabe!L26,1)*IF($B$43=4,Datenausgabe!L20/Datenausgabe!L21,1)","v":0},{"$f":"M44*IF($B$43=1,Datenausgabe!M20/Datenausgabe!M21*Datenausgabe!M22/Datenausgabe!M26,1)*IF($B$43=2,1,1)*IF($B$43=3,Datenausgabe!M22/Datenausgabe!M26,1)*IF($B$43=4,Datenausgabe!M20/Datenausgabe!M21,1)","v":0}]
["TZ Kürzung: - 2",{"$f":"B45*IF($B$43=1,Datenausgabe!B23/Datenausgabe!B24*Datenausgabe!B25/Datenausgabe!B26,1)*IF($B$43=2,1,1)*IF($B$43=3,Datenausgabe!B25/Datenausgabe!B26,1)*IF($B$43=4,Datenausgabe!B23/Datenausgabe!B24,1)","v":0},{"$f":"C45*IF($B$43=1,Datenausgabe!C23/Datenausgabe!C24*Datenausgabe!C25/Datenausgabe!C26,1)*IF($B$43=2,1,1)*IF($B$43=3,Datenausgabe!C25/Datenausgabe!C26,1)*IF($B$43=4,Datenausgabe!C23/Datenausgabe!C24,1)","v":0},{"$f":"D45*IF($B$43=1,Datenausgabe!D23/Datenausgabe!D24*Datenausgabe!D25/Datenausgabe!D26,1)*IF($B$43=2,1,1)*IF($B$43=3,Datenausgabe!D25/Datenausgabe!D26,1)*IF($B$43=4,Datenausgabe!D23/Datenausgabe!D24,1)","v":0},{"$f":"E45*IF($B$43=1,Datenausgabe!E23/Datenausgabe!E24*Datenausgabe!E25/Datenausgabe!E26,1)*IF($B$43=2,1,1)*IF($B$43=3,Datenausgabe!E25/Datenausgabe!E26,1)*IF($B$43=4,Datenausgabe!E23/Datenausgabe!E24,1)","v":0},{"$f":"F45*IF($B$43=1,Datenausgabe!F23/Datenausgabe!F24*Datenausgabe!F25/Datenausgabe!F26,1)*IF($B$43=2,1,1)*IF($B$43=3,Datenausgabe!F25/Datenausgabe!F26,1)*IF($B$43=4,Datenausgabe!F23/Datenausgabe!F24,1)","v":0},{"$f":"G45*IF($B$43=1,Datenausgabe!G23/Datenausgabe!G24*Datenausgabe!G25/Datenausgabe!G26,1)*IF($B$43=2,1,1)*IF($B$43=3,Datenausgabe!G25/Datenausgabe!G26,1)*IF($B$43=4,Datenausgabe!G23/Datenausgabe!G24,1)","v":0},{"$f":"H45*IF($B$43=1,Datenausgabe!H23/Datenausgabe!H24*Datenausgabe!H25/Datenausgabe!H26,1)*IF($B$43=2,1,1)*IF($B$43=3,Datenausgabe!H25/Datenausgabe!H26,1)*IF($B$43=4,Datenausgabe!H23/Datenausgabe!H24,1)","v":0},{"$f":"I45*IF($B$43=1,Datenausgabe!I23/Datenausgabe!I24*Datenausgabe!I25/Datenausgabe!I26,1)*IF($B$43=2,1,1)*IF($B$43=3,Datenausgabe!I25/Datenausgabe!I26,1)*IF($B$43=4,Datenausgabe!I23/Datenausgabe!I24,1)","v":0},{"$f":"J45*IF($B$43=1,Datenausgabe!J23/Datenausgabe!J24*Datenausgabe!J25/Datenausgabe!J26,1)*IF($B$43=2,1,1)*IF($B$43=3,Datenausgabe!J25/Datenausgabe!J26,1)*IF($B$43=4,Datenausgabe!J23/Datenausgabe!J24,1)","v":0},{"$f":"K45*IF($B$43=1,Datenausgabe!K23/Datenausgabe!K24*Datenausgabe!K25/Datenausgabe!K26,1)*IF($B$43=2,1,1)*IF($B$43=3,Datenausgabe!K25/Datenausgabe!K26,1)*IF($B$43=4,Datenausgabe!K23/Datenausgabe!K24,1)","v":0},{"$f":"L45*IF($B$43=1,Datenausgabe!L23/Datenausgabe!L24*Datenausgabe!L25/Datenausgabe!L26,1)*IF($B$43=2,1,1)*IF($B$43=3,Datenausgabe!L25/Datenausgabe!L26,1)*IF($B$43=4,Datenausgabe!L23/Datenausgabe!L24,1)","v":0},{"$f":"M45*IF($B$43=1,Datenausgabe!M23/Datenausgabe!M24*Datenausgabe!M25/Datenausgabe!M26,1)*IF($B$43=2,1,1)*IF($B$43=3,Datenausgabe!M25/Datenausgabe!M26,1)*IF($B$43=4,Datenausgabe!M23/Datenausgabe!M24,1)","v":0}]
[null,{"$f":"IF(Datenausgabe!B41,B50*IF(Datenausgabe!B15,(Datenausgabe!B22+Datenausgabe!B25)/Datenausgabe!B26,Datenausgabe!B22/Datenausgabe!B26),B50)","v":0},{"$f":"IF(Datenausgabe!C41,C50*IF(Datenausgabe!C15,(Datenausgabe!C22+Datenausgabe!C25)/Datenausgabe!C26,Datenausgabe!C22/Datenausgabe!C26),C50)","v":0},{"$f":"IF(Datenausgabe!D41,D50*IF(Datenausgabe!D15,(Datenausgabe!D22+Datenausgabe!D25)/Datenausgabe!D26,Datenausgabe!D22/Datenausgabe!D26),D50)","v":0},{"$f":"IF(Datenausgabe!E41,E50*IF(Datenausgabe!E15,(Datenausgabe!E22+Datenausgabe!E25)/Datenausgabe!E26,Datenausgabe!E22/Datenausgabe!E26),E50)","v":0},{"$f":"IF(Datenausgabe!F41,F50*IF(Datenausgabe!F15,(Datenausgabe!F22+Datenausgabe!F25)/Datenausgabe!F26,Datenausgabe!F22/Datenausgabe!F26),F50)","v":0},{"$f":"IF(Datenausgabe!G41,G50*IF(Datenausgabe!G15,(Datenausgabe!G22+Datenausgabe!G25)/Datenausgabe!G26,Datenausgabe!G22/Datenausgabe!G26),G50)","v":0},{"$f":"IF(Datenausgabe!H41,H50*IF(Datenausgabe!H15,(Datenausgabe!H22+Datenausgabe!H25)/Datenausgabe!H26,Datenausgabe!H22/Datenausgabe!H26),H50)","v":0},{"$f":"IF(Datenausgabe!I41,I50*IF(Datenausgabe!I15,(Datenausgabe!I22+Datenausgabe!I25)/Datenausgabe!I26,Datenausgabe!I22/Datenausgabe!I26),I50)","v":0},{"$f":"IF(Datenausgabe!J41,J50*IF(Datenausgabe!J15,(Datenausgabe!J22+Datenausgabe!J25)/Datenausgabe!J26,Datenausgabe!J22/Datenausgabe!J26),J50)","v":0},{"$f":"IF(Datenausgabe!K41,K50*IF(Datenausgabe!K15,(Datenausgabe!K22+Datenausgabe!K25)/Datenausgabe!K26,Datenausgabe!K22/Datenausgabe!K26),K50)","v":0},{"$f":"IF(Datenausgabe!L41,L50*IF(Datenausgabe!L15,(Datenausgabe!L22+Datenausgabe!L25)/Datenausgabe!L26,Datenausgabe!L22/Datenausgabe!L26),L50)","v":0},{"$f":"IF(Datenausgabe!M41,M50*IF(Datenausgabe!M15,(Datenausgabe!M22+Datenausgabe!M25)/Datenausgabe!M26,Datenausgabe!M22/Datenausgabe!M26),M50)","v":0}]
["Kind OZ Gesamt",{"$f":"IF(Datenausgabe!B1,IF(Datenausgabe!B14,B53,B48),0)","v":0},{"$f":"IF(Datenausgabe!C1,IF(Datenausgabe!C14,C53,C48),0)","v":0},{"$f":"IF(Datenausgabe!D1,IF(Datenausgabe!D14,D53,D48),0)","v":0},{"$f":"IF(Datenausgabe!E1,IF(Datenausgabe!E14,E53,E48),0)","v":0},{"$f":"IF(Datenausgabe!F1,IF(Datenausgabe!F14,F53,F48),0)","v":0},{"$f":"IF(Datenausgabe!G1,IF(Datenausgabe!G14,G53,G48),0)","v":0},{"$f":"IF(Datenausgabe!H1,IF(Datenausgabe!H14,H53,H48),0)","v":0},{"$f":"IF(Datenausgabe!I1,IF(Datenausgabe!I14,I53,I48),0)","v":0},{"$f":"IF(Datenausgabe!J1,IF(Datenausgabe!J14,J53,J48),0)","v":0},{"$f":"IF(Datenausgabe!K1,IF(Datenausgabe!K14,K53,K48),0)","v":0},{"$f":"IF(Datenausgabe!L1,IF(Datenausgabe!L14,L53,L48),0)","v":0},{"$f":"IF(Datenausgabe!M1,IF(Datenausgabe!M14,M53,M48),0)","v":0}]
["Ermittlung der Werte für die Kindererhöhungsbeträge (nur wenn keine Pauschalvergütung angegeben wurde)"]
["Tabellenwert Kind 1 GBZ 1",{"$f":"IF(Datenausgabe!B12<>0,0,VLOOKUP(Datenausgabe!B$6,[2]!Verguetung,20,0))","v":0},{"$f":"IF(Datenausgabe!C12<>0,0,VLOOKUP(Datenausgabe!C$6,[2]!Verguetung,20,0))","v":0},{"$f":"IF(Datenausgabe!D12<>0,0,VLOOKUP(Datenausgabe!D$6,[3]!Verguetung,20,0))","v":0},{"$f":"IF(Datenausgabe!E12<>0,0,VLOOKUP(Datenausgabe!E$6,[3]!Verguetung,20,0))","v":0},{"$f":"IF(Datenausgabe!F12<>0,0,VLOOKUP(Datenausgabe!F$6,[3]!Verguetung,20,0))","v":0},{"$f":"IF(Datenausgabe!G12<>0,0,VLOOKUP(Datenausgabe!G$6,[3]!Verguetung,20,0))","v":0},{"$f":"IF(Datenausgabe!H12<>0,0,VLOOKUP(Datenausgabe!H$6,[3]!Verguetung,20,0))","v":0},{"$f":"IF(Datenausgabe!I12<>0,0,VLOOKUP(Datenausgabe!I$6,[3]!Verguetung,20,0))","v":0},{"$f":"IF(Datenausgabe!J12<>0,0,VLOOKUP(Datenausgabe!J$6,[3]!Verguetung,20,0))","v":0},{"$f":"IF(Datenausgabe!K12<>0,0,VLOOKUP(Datenausgabe!K$6,[3]!Verguetung,20,0))","v":0},{"$f":"IF(Datenausgabe!L12<>0,0,VLOOKUP(Datenausgabe!L$6,[3]!Verguetung,20,0))","v":0},{"$f":"IF(Datenausgabe!M12<>0,0,VLOOKUP(Datenausgabe!M$6,[3]!Verguetung,20,0))","v":0}]
["Tabellenwert ab Kind 2 GBZ 1",{"$f":"IF(Datenausgabe!B12<>0,0,VLOOKUP(Datenausgabe!B$6,[2]!Verguetung,21,0))","v":0},{"$f":"IF(Datenausgabe!C12<>0,0,VLOOKUP(Datenausgabe!C$6,[2]!Verguetung,21,0))","v":0},{"$f":"IF(Datenausgabe!D12<>0,0,VLOOKUP(Datenausgabe!D$6,[3]!Verguetung,21,0))","v":0},{"$f":"IF(Datenausgabe!E12<>0,0,VLOOKUP(Datenausgabe!E$6,[3]!Verguetung,21,0))","v":0},{"$f":"IF(Datenausgabe!F12<>0,0,VLOOKUP(Datenausgabe!F$6,[3]!Verguetung,21,0))","v":0},{"$f":"IF(Datenausgabe!G12<>0,0,VLOOKUP(Datenausgabe!G$6,[3]!Verguetung,21,0))","v":0},{"$f":"IF(Datenausgabe!H12<>0,0,VLOOKUP(Datenausgabe!H$6,[3]!Verguetung,21,0))","v":0},{"$f":"IF(Datenausgabe!I12<>0,0,VLOOKUP(Datenausgabe!I$6,[3]!Verguetung,21,0))","v":0},{"$f":"IF(Datenausgabe!J12<>0,0,VLOOKUP(Datenausgabe!J$6,[3]!Verguetung,21,0))","v":0},{"$f":"IF(Datenausgabe!K12<>0,0,VLOOKUP(Datenausgabe!K$6,[3]!Verguetung,21,0))","v":0},{"$f":"IF(Datenausgabe!L12<>0,0,VLOOKUP(Datenausgabe!L$6,[3]!Verguetung,21,0))","v":0},{"$f":"IF(Datenausgabe!M12<>0,0,VLOOKUP(Datenausgabe!M$6,[3]!Verguetung,21,0))","v":0}]
["Tabellenwert Kind 1 GBZ 2",{"$f":"IF(Datenausgabe!B13<>0,0,VLOOKUP(Datenausgabe!B$7,[2]!Verguetung,20,0))","v":0},{"$f":"IF(Datenausgabe!C13<>0,0,VLOOKUP(Datenausgabe!C$7,[2]!Verguetung,20,0))","v":0},{"$f":"IF(Datenausgabe!D13<>0,0,VLOOKUP(Datenausgabe!D$7,[3]!Verguetung,20,0))","v":0},{"$f":"IF(Datenausgabe!E13<>0,0,VLOOKUP(Datenausgabe!E$7,[3]!Verguetung,20,0))","v":0},{"$f":"IF(Datenausgabe!F13<>0,0,VLOOKUP(Datenausgabe!F$7,[3]!Verguetung,20,0))","v":0},{"$f":"IF(Datenausgabe!G13<>0,0,VLOOKUP(Datenausgabe!G$7,[3]!Verguetung,20,0))","v":0},{"$f":"IF(Datenausgabe!H13<>0,0,VLOOKUP(Datenausgabe!H$7,[3]!Verguetung,20,0))","v":0},{"$f":"IF(Datenausgabe!I13<>0,0,VLOOKUP(Datenausgabe!I$7,[3]!Verguetung,20,0))","v":0},{"$f":"IF(Datenausgabe!J13<>0,0,VLOOKUP(Datenausgabe!J$7,[3]!Verguetung,20,0))","v":0},{"$f":"IF(Datenausgabe!K13<>0,0,VLOOKUP(Datenausgabe!K$7,[3]!Verguetung,20,0))","v":0},{"$f":"IF(Datenausgabe!L13<>0,0,VLOOKUP(Datenausgabe!L$7,[3]!Verguetung,20,0))","v":0},{"$f":"IF(Datenausgabe!M13<>0,0,VLOOKUP(Datenausgabe!M$7,[3]!Verguetung,20,0))","v":0}]
["Tabellenwert ab Kind 2 GBZ 2",{"$f":"IF(Datenausgabe!B13<>0,0,VLOOKUP(Datenausgabe!B$7,[2]!Verguetung,21,0))","v":0},{"$f":"IF(Datenausgabe!C13<>0,0,VLOOKUP(Datenausgabe!C$7,[2]!Verguetung,21,0))","v":0},{"$f":"IF(Datenausgabe!D13<>0,0,VLOOKUP(Datenausgabe!D$7,[3]!Verguetung,21,0))","v":0},{"$f":"IF(Datenausgabe!E13<>0,0,VLOOKUP(Datenausgabe!E$7,[3]!Verguetung,21,0))","v":0},{"$f":"IF(Datenausgabe!F13<>0,0,VLOOKUP(Datenausgabe!F$7,[3]!Verguetung,21,0))","v":0},{"$f":"IF(Datenausgabe!G13<>0,0,VLOOKUP(Datenausgabe!G$7,[3]!Verguetung,21,0))","v":0},{"$f":"IF(Datenausgabe!H13<>0,0,VLOOKUP(Datenausgabe!H$7,[3]!Verguetung,21,0))","v":0},{"$f":"IF(Datenausgabe!I13<>0,0,VLOOKUP(Datenausgabe!I$7,[3]!Verguetung,21,0))","v":0},{"$f":"IF(Datenausgabe!J13<>0,0,VLOOKUP(Datenausgabe!J$7,[3]!Verguetung,21,0))","v":0},{"$f":"IF(Datenausgabe!K13<>0,0,VLOOKUP(Datenausgabe!K$7,[3]!Verguetung,21,0))","v":0},{"$f":"IF(Datenausgabe!L13<>0,0,VLOOKUP(Datenausgabe!L$7,[3]!Verguetung,21,0))","v":0},{"$f":"IF(Datenausgabe!M13<>0,0,VLOOKUP(Datenausgabe!M$7,[3]!Verguetung,21,0))","v":0}]
["Kind erh. TZ Klassif:",{"$f":"VALUE(MID(Arbeitgeberkosten!$E$12,5,1))","v":1}," 1 = Teilzeit & Tage ' 2 = ungekürzt' 3 = Tage-Kürzung' 4 = Teilzeit-Kürzung"]
["Summe für alle Kinder, GBZ 1",{"$f":"IF(Datenausgabe!B36<=1,B56*Datenausgabe!B36,(Datenausgabe!B36-1)*B57+B56)","v":0},{"$f":"IF(Datenausgabe!C36<=1,C56*Datenausgabe!C36,(Datenausgabe!C36-1)*C57+C56)","v":0},{"$f":"IF(Datenausgabe!D36<=1,D56*Datenausgabe!D36,(Datenausgabe!D36-1)*D57+D56)","v":0},{"$f":"IF(Datenausgabe!E36<=1,E56*Datenausgabe!E36,(Datenausgabe!E36-1)*E57+E56)","v":0},{"$f":"IF(Datenausgabe!F36<=1,F56*Datenausgabe!F36,(Datenausgabe!F36-1)*F57+F56)","v":0},{"$f":"IF(Datenausgabe!G36<=1,G56*Datenausgabe!G36,(Datenausgabe!G36-1)*G57+G56)","v":0},{"$f":"IF(Datenausgabe!H36<=1,H56*Datenausgabe!H36,(Datenausgabe!H36-1)*H57+H56)","v":0},{"$f":"IF(Datenausgabe!I36<=1,I56*Datenausgabe!I36,(Datenausgabe!I36-1)*I57+I56)","v":0},{"$f":"IF(Datenausgabe!J36<=1,J56*Datenausgabe!J36,(Datenausgabe!J36-1)*J57+J56)","v":0},{"$f":"IF(Datenausgabe!K36<=1,K56*Datenausgabe!K36,(Datenausgabe!K36-1)*K57+K56)","v":0},{"$f":"IF(Datenausgabe!L36<=1,L56*Datenausgabe!L36,(Datenausgabe!L36-1)*L57+L56)","v":0},{"$f":"IF(Datenausgabe!M36<=1,M56*Datenausgabe!M36,(Datenausgabe!M36-1)*M57+M56)","v":0}]
["Summe für alle Kinder, GBZ 2",{"$f":"IF(Datenausgabe!B36<=1,B58*Datenausgabe!B36,(Datenausgabe!B36-1)*B59+B58)","v":0},{"$f":"IF(Datenausgabe!C36<=1,C58*Datenausgabe!C36,(Datenausgabe!C36-1)*C59+C58)","v":0},{"$f":"IF(Datenausgabe!D36<=1,D58*Datenausgabe!D36,(Datenausgabe!D36-1)*D59+D58)","v":0},{"$f":"IF(Datenausgabe!E36<=1,E58*Datenausgabe!E36,(Datenausgabe!E36-1)*E59+E58)","v":0},{"$f":"IF(Datenausgabe!F36<=1,F58*Datenausgabe!F36,(Datenausgabe!F36-1)*F59+F58)","v":0},{"$f":"IF(Datenausgabe!G36<=1,G58*Datenausgabe!G36,(Datenausgabe!G36-1)*G59+G58)","v":0},{"$f":"IF(Datenausgabe!H36<=1,H58*Datenausgabe!H36,(Datenausgabe!H36-1)*H59+H58)","v":0},{"$f":"IF(Datenausgabe!I36<=1,I58*Datenausgabe!I36,(Datenausgabe!I36-1)*I59+I58)","v":0},{"$f":"IF(Datenausgabe!J36<=1,J58*Datenausgabe!J36,(Datenausgabe!J36-1)*J59+J58)","v":0},{"$f":"IF(Datenausgabe!K36<=1,K58*Datenausgabe!K36,(Datenausgabe!K36-1)*K59+K58)","v":0},{"$f":"IF(Datenausgabe!L36<=1,L58*Datenausgabe!L36,(Datenausgabe!L36-1)*L59+L58)","v":0},{"$f":"IF(Datenausgabe!M36<=1,M58*Datenausgabe!M36,(Datenausgabe!M36-1)*M59+M58)","v":0}]
["Kind erh (ggf. Konk. Bruch) TZ 1",{"$f":"IF(Datenausgabe!B35,B61*Datenausgabe!B39/Datenausgabe!B40,IF(Datenausgabe!B34,B61*IF($B$60=1,Datenausgabe!B20/Datenausgabe!B21*Datenausgabe!B22/Datenausgabe!B26,1)*IF($B$60=2,1,1)*IF($B$60=3,Datenausgabe!B22/Datenausgabe!B26,1)*IF($B$60=4,Datenausgabe!B20/Datenausgabe!B21,1),B61))","v":0},{"$f":"IF(Datenausgabe!C35,C61*Datenausgabe!C39/Datenausgabe!C40,IF(Datenausgabe!C34,C61*IF($B$60=1,Datenausgabe!C20/Datenausgabe!C21*Datenausgabe!C22/Datenausgabe!C26,1)*IF($B$60=2,1,1)*IF($B$60=3,Datenausgabe!C22/Datenausgabe!C26,1)*IF($B$60=4,Datenausgabe!C20/Datenausgabe!C21,1),C61))","v":0},{"$f":"IF(Datenausgabe!D35,D61*Datenausgabe!D39/Datenausgabe!D40,IF(Datenausgabe!D34,D61*IF($B$60=1,Datenausgabe!D20/Datenausgabe!D21*Datenausgabe!D22/Datenausgabe!D26,1)*IF($B$60=2,1,1)*IF($B$60=3,Datenausgabe!D22/Datenausgabe!D26,1)*IF($B$60=4,Datenausgabe!D20/Datenausgabe!D21,1),D61))","v":0},{"$f":"IF(Datenausgabe!E35,E61*Datenausgabe!E39/Datenausgabe!E40,IF(Datenausgabe!E34,E61*IF($B$60=1,Datenausgabe!E20/Datenausgabe!E21*Datenausgabe!E22/Datenausgabe!E26,1)*IF($B$60=2,1,1)*IF($B$60=3,Datenausgabe!E22/Datenausgabe!E26,1)*IF($B$60=4,Datenausgabe!E20/Datenausgabe!E21,1),E61))","v":0},{"$f":"IF(Datenausgabe!F35,F61*Datenausgabe!F39/Datenausgabe!F40,IF(Datenausgabe!F34,F61*IF($B$60=1,Datenausgabe!F20/Datenausgabe!F21*Datenausgabe!F22/Datenausgabe!F26,1)*IF($B$60=2,1,1)*IF($B$60=3,Datenausgabe!F22/Datenausgabe!F26,1)*IF($B$60=4,Datenausgabe!F20/Datenausgabe!F21,1),F61))","v":0},{"$f":"IF(Datenausgabe!G35,G61*Datenausgabe!G39/Datenausgabe!G40,IF(Datenausgabe!G34,G61*IF($B$60=1,Datenausgabe!G20/Datenausgabe!G21*Datenausgabe!G22/Datenausgabe!G26,1)*IF($B$60=2,1,1)*IF($B$60=3,Datenausgabe!G22/Datenausgabe!G26,1)*IF($B$60=4,Datenausgabe!G20/Datenausgabe!G21,1),G61))","v":0},{"$f":"IF(Datenausgabe!H35,H61*Datenausgabe!H39/Datenausgabe!H40,IF(Datenausgabe!H34,H61*IF($B$60=1,Datenausgabe!H20/Datenausgabe!H21*Datenausgabe!H22/Datenausgabe!H26,1)*IF($B$60=2,1,1)*IF($B$60=3,Datenausgabe!H22/Datenausgabe!H26,1)*IF($B$60=4,Datenausgabe!H20/Datenausgabe!H21,1),H61))","v":0},{"$f":"IF(Datenausgabe!I35,I61*Datenausgabe!I39/Datenausgabe!I40,IF(Datenausgabe!I34,I61*IF($B$60=1,Datenausgabe!I20/Datenausgabe!I21*Datenausgabe!I22/Datenausgabe!I26,1)*IF($B$60=2,1,1)*IF($B$60=3,Datenausgabe!I22/Datenausgabe!I26,1)*IF($B$60=4,Datenausgabe!I20/Datenausgabe!I21,1),I61))","v":0},{"$f":"IF(Datenausgabe!J35,J61*Datenausgabe!J39/Datenausgabe!J40,IF(Datenausgabe!J34,J61*IF($B$60=1,Datenausgabe!J20/Datenausgabe!J21*Datenausgabe!J22/Datenausgabe!J26,1)*IF($B$60=2,1,1)*IF($B$60=3,Datenausgabe!J22/Datenausgabe!J26,1)*IF($B$60=4,Datenausgabe!J20/Datenausgabe!J21,1),J61))","v":0},{"$f":"IF(Datenausgabe!K35,K61*Datenausgabe!K39/Datenausgabe!K40,IF(Datenausgabe!K34,K61*IF($B$60=1,Datenausgabe!K20/Datenausgabe!K21*Datenausgabe!K22/Datenausgabe!K26,1)*IF($B$60=2,1,1)*IF($B$60=3,Datenausgabe!K22/Datenausgabe!K26,1)*IF($B$60=4,Datenausgabe!K20/Datenausgabe!K21,1),K61))","v":0},{"$f":"IF(Datenausgabe!L35,L61*Datenausgabe!L39/Datenausgabe!L40,IF(Datenausgabe!L34,L61*IF($B$60=1,Datenausgabe!L20/Datenausgabe!L21*Datenausgabe!L22/Datenausgabe!L26,1)*IF($B$60=2,1,1)*IF($B$60=3,Datenausgabe!L22/Datenausgabe!L26,1)*IF($B$60=4,Datenausgabe!L20/Datenausgabe!L21,1),L61))","v":0},{"$f":"IF(Datenausgabe!M35,M61*Datenausgabe!M39/Datenausgabe!M40,IF(Datenausgabe!M34,M61*IF($B$60=1,Datenausgabe!M20/Datenausgabe!M21*Datenausgabe!M22/Datenausgabe!M26,1)*IF($B$60=2,1,1)*IF($B$60=3,Datenausgabe!M22/Datenausgabe!M26,1)*IF($B$60=4,Datenausgabe!M20/Datenausgabe!M21,1),M61))","v":0}]
["Kind erh (ggf. Konk. Bruch) TZ 2",{"$f":"IF(Datenausgabe!B35,B62*Datenausgabe!B39/Datenausgabe!B40,IF(Datenausgabe!B34,B62*IF($B$60=1,Datenausgabe!B23/Datenausgabe!B24*Datenausgabe!B25/Datenausgabe!B26,1)*IF($B$60=2,1,1)*IF($B$60=3,Datenausgabe!B25/Datenausgabe!B26,1)*IF($B$60=4,Datenausgabe!B23/Datenausgabe!B24,1),B62))","v":0},{"$f":"IF(Datenausgabe!C35,C62*Datenausgabe!C39/Datenausgabe!C40,IF(Datenausgabe!C34,C62*IF($B$60=1,Datenausgabe!C23/Datenausgabe!C24*Datenausgabe!C25/Datenausgabe!C26,1)*IF($B$60=2,1,1)*IF($B$60=3,Datenausgabe!C25/Datenausgabe!C26,1)*IF($B$60=4,Datenausgabe!C23/Datenausgabe!C24,1),C62))","v":0},{"$f":"IF(Datenausgabe!D35,D62*Datenausgabe!D39/Datenausgabe!D40,IF(Datenausgabe!D34,D62*IF($B$60=1,Datenausgabe!D23/Datenausgabe!D24*Datenausgabe!D25/Datenausgabe!D26,1)*IF($B$60=2,1,1)*IF($B$60=3,Datenausgabe!D25/Datenausgabe!D26,1)*IF($B$60=4,Datenausgabe!D23/Datenausgabe!D24,1),D62))","v":0},{"$f":"IF(Datenausgabe!E35,E62*Datenausgabe!E39/Datenausgabe!E40,IF(Datenausgabe!E34,E62*IF($B$60=1,Datenausgabe!E23/Datenausgabe!E24*Datenausgabe!E25/Datenausgabe!E26,1)*IF($B$60=2,1,1)*IF($B$60=3,Datenausgabe!E25/Datenausgabe!E26,1)*IF($B$60=4,Datenausgabe!E23/Datenausgabe!E24,1),E62))","v":0},{"$f":"IF(Datenausgabe!F35,F62*Datenausgabe!F39/Datenausgabe!F40,IF(Datenausgabe!F34,F62*IF($B$60=1,Datenausgabe!F23/Datenausgabe!F24*Datenausgabe!F25/Datenausgabe!F26,1)*IF($B$60=2,1,1)*IF($B$60=3,Datenausgabe!F25/Datenausgabe!F26,1)*IF($B$60=4,Datenausgabe!F23/Datenausgabe!F24,1),F62))","v":0},{"$f":"IF(Datenausgabe!G35,G62*Datenausgabe!G39/Datenausgabe!G40,IF(Datenausgabe!G34,G62*IF($B$60=1,Datenausgabe!G23/Datenausgabe!G24*Datenausgabe!G25/Datenausgabe!G26,1)*IF($B$60=2,1,1)*IF($B$60=3,Datenausgabe!G25/Datenausgabe!G26,1)*IF($B$60=4,Datenausgabe!G23/Datenausgabe!G24,1),G62))","v":0},{"$f":"IF(Datenausgabe!H35,H62*Datenausgabe!H39/Datenausgabe!H40,IF(Datenausgabe!H34,H62*IF($B$60=1,Datenausgabe!H23/Datenausgabe!H24*Datenausgabe!H25/Datenausgabe!H26,1)*IF($B$60=2,1,1)*IF($B$60=3,Datenausgabe!H25/Datenausgabe!H26,1)*IF($B$60=4,Datenausgabe!H23/Datenausgabe!H24,1),H62))","v":0},{"$f":"IF(Datenausgabe!I35,I62*Datenausgabe!I39/Datenausgabe!I40,IF(Datenausgabe!I34,I62*IF($B$60=1,Datenausgabe!I23/Datenausgabe!I24*Datenausgabe!I25/Datenausgabe!I26,1)*IF($B$60=2,1,1)*IF($B$60=3,Datenausgabe!I25/Datenausgabe!I26,1)*IF($B$60=4,Datenausgabe!I23/Datenausgabe!I24,1),I62))","v":0},{"$f":"IF(Datenausgabe!J35,J62*Datenausgabe!J39/Datenausgabe!J40,IF(Datenausgabe!J34,J62*IF($B$60=1,Datenausgabe!J23/Datenausgabe!J24*Datenausgabe!J25/Datenausgabe!J26,1)*IF($B$60=2,1,1)*IF($B$60=3,Datenausgabe!J25/Datenausgabe!J26,1)*IF($B$60=4,Datenausgabe!J23/Datenausgabe!J24,1),J62))","v":0},{"$f":"IF(Datenausgabe!K35,K62*Datenausgabe!K39/Datenausgabe!K40,IF(Datenausgabe!K34,K62*IF($B$60=1,Datenausgabe!K23/Datenausgabe!K24*Datenausgabe!K25/Datenausgabe!K26,1)*IF($B$60=2,1,1)*IF($B$60=3,Datenausgabe!K25/Datenausgabe!K26,1)*IF($B$60=4,Datenausgabe!K23/Datenausgabe!K24,1),K62))","v":0},{"$f":"IF(Datenausgabe!L35,L62*Datenausgabe!L39/Datenausgabe!L40,IF(Datenausgabe!L34,L62*IF($B$60=1,Datenausgabe!L23/Datenausgabe!L24*Datenausgabe!L25/Datenausgabe!L26,1)*IF($B$60=2,1,1)*IF($B$60=3,Datenausgabe!L25/Datenausgabe!L26,1)*IF($B$60=4,Datenausgabe!L23/Datenausgabe!L24,1),L62))","v":0},{"$f":"IF(Datenausgabe!M35,M62*Datenausgabe!M39/Datenausgabe!M40,IF(Datenausgabe!M34,M62*IF($B$60=1,Datenausgabe!M23/Datenausgabe!M24*Datenausgabe!M25/Datenausgabe!M26,1)*IF($B$60=2,1,1)*IF($B$60=3,Datenausgabe!M25/Datenausgabe!M26,1)*IF($B$60=4,Datenausgabe!M23/Datenausgabe!M24,1),M62))","v":0}]
["Kind erh Gesamt",{"$f":"IF(Datenausgabe!B1,B63+IF(Datenausgabe!B14,B64,0),0)","v":0},{"$f":"IF(Datenausgabe!C1,C63+IF(Datenausgabe!C14,C64,0),0)","v":0},{"$f":"IF(Datenausgabe!D1,D63+IF(Datenausgabe!D14,D64,0),0)","v":0},{"$f":"IF(Datenausgabe!E1,E63+IF(Datenausgabe!E14,E64,0),0)","v":0},{"$f":"IF(Datenausgabe!F1,F63+IF(Datenausgabe!F14,F64,0),0)","v":0},{"$f":"IF(Datenausgabe!G1,G63+IF(Datenausgabe!G14,G64,0),0)","v":0},{"$f":"IF(Datenausgabe!H1,H63+IF(Datenausgabe!H14,H64,0),0)","v":0},{"$f":"IF(Datenausgabe!I1,I63+IF(Datenausgabe!I14,I64,0),0)","v":0},{"$f":"IF(Datenausgabe!J1,J63+IF(Datenausgabe!J14,J64,0),0)","v":0},{"$f":"IF(Datenausgabe!K1,K63+IF(Datenausgabe!K14,K64,0),0)","v":0},{"$f":"IF(Datenausgabe!L1,L63+IF(Datenausgabe!L14,L64,0),0)","v":0},{"$f":"IF(Datenausgabe!M1,M63+IF(Datenausgabe!M14,M64,0),0)","v":0}]
["Ermittlung der Werte für die Tarifzulage (nur wenn keine Pauschalvergütung angegeben wurde)"]
["Tabellenwert GBZ 1 (ggf. kl. Zul.)",{"$f":"IF(OR(Datenausgabe!B12<>0,Datenausgabe!B47=Einstellungen!$C$29),0,VLOOKUP(IF(Datenausgabe!B47=Einstellungen!$C$30,Datenausgabe!B$6,Einstellungen!$N$2),[2]!Verguetung,23,0))","v":0},{"$f":"IF(OR(Datenausgabe!C12<>0,Datenausgabe!C47=Einstellungen!$C$29),0,VLOOKUP(IF(Datenausgabe!C47=Einstellungen!$C$30,Datenausgabe!C$6,Einstellungen!$N$2),[2]!Verguetung,23,0))","v":0},{"$f":"IF(OR(Datenausgabe!D12<>0,Datenausgabe!D47=Einstellungen!$C$29),0,VLOOKUP(IF(Datenausgabe!D47=Einstellungen!$C$30,Datenausgabe!D$6,Einstellungen!$N$2),[3]!Verguetung,23,0))","v":0},{"$f":"IF(OR(Datenausgabe!E12<>0,Datenausgabe!E47=Einstellungen!$C$29),0,VLOOKUP(IF(Datenausgabe!E47=Einstellungen!$C$30,Datenausgabe!E$6,Einstellungen!$N$2),[3]!Verguetung,23,0))","v":0},{"$f":"IF(OR(Datenausgabe!F12<>0,Datenausgabe!F47=Einstellungen!$C$29),0,VLOOKUP(IF(Datenausgabe!F47=Einstellungen!$C$30,Datenausgabe!F$6,Einstellungen!$N$2),[3]!Verguetung,23,0))","v":0},{"$f":"IF(OR(Datenausgabe!G12<>0,Datenausgabe!G47=Einstellungen!$C$29),0,VLOOKUP(IF(Datenausgabe!G47=Einstellungen!$C$30,Datenausgabe!G$6,Einstellungen!$N$2),[3]!Verguetung,23,0))","v":0},{"$f":"IF(OR(Datenausgabe!H12<>0,Datenausgabe!H47=Einstellungen!$C$29),0,VLOOKUP(IF(Datenausgabe!H47=Einstellungen!$C$30,Datenausgabe!H$6,Einstellungen!$N$2),[3]!Verguetung,23,0))","v":0},{"$f":"IF(OR(Datenausgabe!I12<>0,Datenausgabe!I47=Einstellungen!$C$29),0,VLOOKUP(IF(Datenausgabe!I47=Einstellungen!$C$30,Datenausgabe!I$6,Einstellungen!$N$2),[3]!Verguetung,23,0))","v":0},{"$f":"IF(OR(Datenausgabe!J12<>0,Datenausgabe!J47=Einstellungen!$C$29),0,VLOOKUP(IF(Datenausgabe!J47=Einstellungen!$C$30,Datenausgabe!J$6,Einstellungen!$N$2),[3]!Verguetung,23,0))","v":0},{"$f":"IF(OR(Datenausgabe!K12<>0,Datenausgabe!K47=Einstellungen!$C$29),0,VLOOKUP(IF(Datenausgabe!K47=Einstellungen!$C$30,Datenausgabe!K$6,Einstellungen!$N$2),[3]!Verguetung,23,0))","v":0},{"$f":"IF(OR(Datenausgabe!L12<>0,Datenausgabe!L47=Einstellungen!$C$29),0,VLOOKUP(IF(Datenausgabe!L47=Einstellungen!$C$30,Datenausgabe!L$6,Einstellungen!$N$2),[3]!Verguetung,23,0))","v":0},{"$f":"IF(OR(Datenausgabe!M12<>0,Datenausgabe!M47=Einstellungen!$C$29),0,VLOOKUP(IF(Datenausgabe!M47=Einstellungen!$C$30,Datenausgabe!M$6,Einstellungen!$N$2),[3]!Verguetung,23,0))","v":0}]
["Tabellenwert GBZ 2 (ggf. kl. Zul.)",{"$f":"IF(OR(Datenausgabe!B13<>0,Datenausgabe!B47=Einstellungen!$C$29),0,VLOOKUP(IF(Datenausgabe!B47=Einstellungen!$C$30,Datenausgabe!B$7,Einstellungen!$N$2),[2]!Verguetung,23,0))","v":0},{"$f":"IF(OR(Datenausgabe!C13<>0,Datenausgabe!C47=Einstellungen!$C$29),0,VLOOKUP(IF(Datenausgabe!C47=Einstellungen!$C$30,Datenausgabe!C$7,Einstellungen!$N$2),[2]!Verguetung,23,0))","v":0},{"$f":"IF(OR(Datenausgabe!D13<>0,Datenausgabe!D47=Einstellungen!$C$29),0,VLOOKUP(IF(Datenausgabe!D47=Einstellungen!$C$30,Datenausgabe!D$7,Einstellungen!$N$2),[3]!Verguetung,23,0))","v":0},{"$f":"IF(OR(Datenausgabe!E13<>0,Datenausgabe!E47=Einstellungen!$C$29),0,VLOOKUP(IF(Datenausgabe!E47=Einstellungen!$C$30,Datenausgabe!E$7,Einstellungen!$N$2),[3]!Verguetung,23,0))","v":0},{"$f":"IF(OR(Datenausgabe!F13<>0,Datenausgabe!F47=Einstellungen!$C$29),0,VLOOKUP(IF(Datenausgabe!F47=Einstellungen!$C$30,Datenausgabe!F$7,Einstellungen!$N$2),[3]!Verguetung,23,0))","v":0},{"$f":"IF(OR(Datenausgabe!G13<>0,Datenausgabe!G47=Einstellungen!$C$29),0,VLOOKUP(IF(Datenausgabe!G47=Einstellungen!$C$30,Datenausgabe!G$7,Einstellungen!$N$2),[3]!Verguetung,23,0))","v":0},{"$f":"IF(OR(Datenausgabe!H13<>0,Datenausgabe!H47=Einstellungen!$C$29),0,VLOOKUP(IF(Datenausgabe!H47=Einstellungen!$C$30,Datenausgabe!H$7,Einstellungen!$N$2),[3]!Verguetung,23,0))","v":0},{"$f":"IF(OR(Datenausgabe!I13<>0,Datenausgabe!I47=Einstellungen!$C$29),0,VLOOKUP(IF(Datenausgabe!I47=Einstellungen!$C$30,Datenausgabe!I$7,Einstellungen!$N$2),[3]!Verguetung,23,0))","v":0},{"$f":"IF(OR(Datenausgabe!J13<>0,Datenausgabe!J47=Einstellungen!$C$29),0,VLOOKUP(IF(Datenausgabe!J47=Einstellungen!$C$30,Datenausgabe!J$7,Einstellungen!$N$2),[3]!Verguetung,23,0))","v":0},{"$f":"IF(OR(Datenausgabe!K13<>0,Datenausgabe!K47=Einstellungen!$C$29),0,VLOOKUP(IF(Datenausgabe!K47=Einstellungen!$C$30,Datenausgabe!K$7,Einstellungen!$N$2),[3]!Verguetung,23,0))","v":0},{"$f":"IF(OR(Datenausgabe!L13<>0,Datenausgabe!L47=Einstellungen!$C$29),0,VLOOKUP(IF(Datenausgabe!L47=Einstellungen!$C$30,Datenausgabe!L$7,Einstellungen!$N$2),[3]!Verguetung,23,0))","v":0},{"$f":"IF(OR(Datenausgabe!M13<>0,Datenausgabe!M47=Einstellungen!$C$29),0,VLOOKUP(IF(Datenausgabe!M47=Einstellungen!$C$30,Datenausgabe!M$7,Einstellungen!$N$2),[3]!Verguetung,23,0))","v":0}]
["Allg. Zulage TZ Klassif:",{"$f":"VALUE(MID(Arbeitgeberkosten!$E$13,5,1))","v":1}," 1 = Teilzeit & Tage ' 2 = ungekürzt' 3 = Tage-Kürzung' 4 = Teilzeit-Kürzung"]
["Allg. Zulage TZ 1",{"$f":"B67*IF($B$69=1,Datenausgabe!B20/Datenausgabe!B21*Datenausgabe!B22/Datenausgabe!B26,1)*IF($B$69=2,1,1)*IF($B$69=3,Datenausgabe!B22/Datenausgabe!B26,1)*IF($B$69=4,Datenausgabe!B20/Datenausgabe!B21,1)","v":0},{"$f":"C67*IF($B$69=1,Datenausgabe!C20/Datenausgabe!C21*Datenausgabe!C22/Datenausgabe!C26,1)*IF($B$69=2,1,1)*IF($B$69=3,Datenausgabe!C22/Datenausgabe!C26,1)*IF($B$69=4,Datenausgabe!C20/Datenausgabe!C21,1)","v":0},{"$f":"D67*IF($B$69=1,Datenausgabe!D20/Datenausgabe!D21*Datenausgabe!D22/Datenausgabe!D26,1)*IF($B$69=2,1,1)*IF($B$69=3,Datenausgabe!D22/Datenausgabe!D26,1)*IF($B$69=4,Datenausgabe!D20/Datenausgabe!D21,1)","v":0},{"$f":"E67*IF($B$69=1,Datenausgabe!E20/Datenausgabe!E21*Datenausgabe!E22/Datenausgabe!E26,1)*IF($B$69=2,1,1)*IF($B$69=3,Datenausgabe!E22/Datenausgabe!E26,1)*IF($B$69=4,Datenausgabe!E20/Datenausgabe!E21,1)","v":0},{"$f":"F67*IF($B$69=1,Datenausgabe!F20/Datenausgabe!F21*Datenausgabe!F22/Datenausgabe!F26,1)*IF($B$69=2,1,1)*IF($B$69=3,Datenausgabe!F22/Datenausgabe!F26,1)*IF($B$69=4,Datenausgabe!F20/Datenausgabe!F21,1)","v":0},{"$f":"G67*IF($B$69=1,Datenausgabe!G20/Datenausgabe!G21*Datenausgabe!G22/Datenausgabe!G26,1)*IF($B$69=2,1,1)*IF($B$69=3,Datenausgabe!G22/Datenausgabe!G26,1)*IF($B$69=4,Datenausgabe!G20/Datenausgabe!G21,1)","v":0},{"$f":"H67*IF($B$69=1,Datenausgabe!H20/Datenausgabe!H21*Datenausgabe!H22/Datenausgabe!H26,1)*IF($B$69=2,1,1)*IF($B$69=3,Datenausgabe!H22/Datenausgabe!H26,1)*IF($B$69=4,Datenausgabe!H20/Datenausgabe!H21,1)","v":0},{"$f":"I67*IF($B$69=1,Datenausgabe!I20/Datenausgabe!I21*Datenausgabe!I22/Datenausgabe!I26,1)*IF($B$69=2,1,1)*IF($B$69=3,Datenausgabe!I22/Datenausgabe!I26,1)*IF($B$69=4,Datenausgabe!I20/Datenausgabe!I21,1)","v":0},{"$f":"J67*IF($B$69=1,Datenausgabe!J20/Datenausgabe!J21*Datenausgabe!J22/Datenausgabe!J26,1)*IF($B$69=2,1,1)*IF($B$69=3,Datenausgabe!J22/Datenausgabe!J26,1)*IF($B$69=4,Datenausgabe!J20/Datenausgabe!J21,1)","v":0},{"$f":"K67*IF($B$69=1,Datenausgabe!K20/Datenausgabe!K21*Datenausgabe!K22/Datenausgabe!K26,1)*IF($B$69=2,1,1)*IF($B$69=3,Datenausgabe!K22/Datenausgabe!K26,1)*IF($B$69=4,Datenausgabe!K20/Datenausgabe!K21,1)","v":0},{"$f":"L67*IF($B$69=1,Datenausgabe!L20/Datenausgabe!L21*Datenausgabe!L22/Datenausgabe!L26,1)*IF($B$69=2,1,1)*IF($B$69=3,Datenausgabe!L22/Datenausgabe!L26,1)*IF($B$69=4,Datenausgabe!L20/Datenausgabe!L21,1)","v":0},{"$f":"M67*IF($B$69=1,Datenausgabe!M20/Datenausgabe!M21*Datenausgabe!M22/Datenausgabe!M26,1)*IF($B$69=2,1,1)*IF($B$69=3,Datenausgabe!M22/Datenausgabe!M26,1)*IF($B$69=4,Datenausgabe!M20/Datenausgabe!M21,1)","v":0}]
["Allg. Zulage TZ 2",{"$f":"B68*IF($B$69=1,Datenausgabe!B23/Datenausgabe!B24*Datenausgabe!B25/Datenausgabe!B26,1)*IF($B$69=2,1,1)*IF($B$69=3,Datenausgabe!B25/Datenausgabe!B26,1)*IF($B$69=4,Datenausgabe!B23/Datenausgabe!B24,1)","v":0},{"$f":"C68*IF($B$69=1,Datenausgabe!C23/Datenausgabe!C24*Datenausgabe!C25/Datenausgabe!C26,1)*IF($B$69=2,1,1)*IF($B$69=3,Datenausgabe!C25/Datenausgabe!C26,1)*IF($B$69=4,Datenausgabe!C23/Datenausgabe!C24,1)","v":0},{"$f":"D68*IF($B$69=1,Datenausgabe!D23/Datenausgabe!D24*Datenausgabe!D25/Datenausgabe!D26,1)*IF($B$69=2,1,1)*IF($B$69=3,Datenausgabe!D25/Datenausgabe!D26,1)*IF($B$69=4,Datenausgabe!D23/Datenausgabe!D24,1)","v":0},{"$f":"E68*IF($B$69=1,Datenausgabe!E23/Datenausgabe!E24*Datenausgabe!E25/Datenausgabe!E26,1)*IF($B$69=2,1,1)*IF($B$69=3,Datenausgabe!E25/Datenausgabe!E26,1)*IF($B$69=4,Datenausgabe!E23/Datenausgabe!E24,1)","v":0},{"$f":"F68*IF($B$69=1,Datenausgabe!F23/Datenausgabe!F24*Datenausgabe!F25/Datenausgabe!F26,1)*IF($B$69=2,1,1)*IF($B$69=3,Datenausgabe!F25/Datenausgabe!F26,1)*IF($B$69=4,Datenausgabe!F23/Datenausgabe!F24,1)","v":0},{"$f":"G68*IF($B$69=1,Datenausgabe!G23/Datenausgabe!G24*Datenausgabe!G25/Datenausgabe!G26,1)*IF($B$69=2,1,1)*IF($B$69=3,Datenausgabe!G25/Datenausgabe!G26,1)*IF($B$69=4,Datenausgabe!G23/Datenausgabe!G24,1)","v":0},{"$f":"H68*IF($B$69=1,Datenausgabe!H23/Datenausgabe!H24*Datenausgabe!H25/Datenausgabe!H26,1)*IF($B$69=2,1,1)*IF($B$69=3,Datenausgabe!H25/Datenausgabe!H26,1)*IF($B$69=4,Datenausgabe!H23/Datenausgabe!H24,1)","v":0},{"$f":"I68*IF($B$69=1,Datenausgabe!I23/Datenausgabe!I24*Datenausgabe!I25/Datenausgabe!I26,1)*IF($B$69=2,1,1)*IF($B$69=3,Datenausgabe!I25/Datenausgabe!I26,1)*IF($B$69=4,Datenausgabe!I23/Datenausgabe!I24,1)","v":0},{"$f":"J68*IF($B$69=1,Datenausgabe!J23/Datenausgabe!J24*Datenausgabe!J25/Datenausgabe!J26,1)*IF($B$69=2,1,1)*IF($B$69=3,Datenausgabe!J25/Datenausgabe!J26,1)*IF($B$69=4,Datenausgabe!J23/Datenausgabe!J24,1)","v":0},{"$f":"K68*IF($B$69=1,Datenausgabe!K23/Datenausgabe!K24*Datenausgabe!K25/Datenausgabe!K26,1)*IF($B$69=2,1,1)*IF($B$69=3,Datenausgabe!K25/Datenausgabe!K26,1)*IF($B$69=4,Datenausgabe!K23/Datenausgabe!K24,1)","v":0},{"$f":"L68*IF($B$69=1,Datenausgabe!L23/Datenausgabe!L24*Datenausgabe!L25/Datenausgabe!L26,1)*IF($B$69=2,1,1)*IF($B$69=3,Datenausgabe!L25/Datenausgabe!L26,1)*IF($B$69=4,Datenausgabe!L23/Datenausgabe!L24,1)","v":0},{"$f":"M68*IF($B$69=1,Datenausgabe!M23/Datenausgabe!M24*Datenausgabe!M25/Datenausgabe!M26,1)*IF($B$69=2,1,1)*IF($B$69=3,Datenausgabe!M25/Datenausgabe!M26,1)*IF($B$69=4,Datenausgabe!M23/Datenausgabe!M24,1)","v":0}]
["Allg. Zulage Gesamt",{"$f":"IF(Datenausgabe!B1,B70+IF(Datenausgabe!B14,B71,0),0)","v":0},{"$f":"IF(Datenausgabe!C1,C70+IF(Datenausgabe!C14,C71,0),0)","v":0},{"$f":"IF(Datenausgabe!D1,D70+IF(Datenausgabe!D14,D71,0),0)","v":0},{"$f":"IF(Datenausgabe!E1,E70+IF(Datenausgabe!E14,E71,0),0)","v":0},{"$f":"IF(Datenausgabe!F1,F70+IF(Datenausgabe!F14,F71,0),0)","v":0},{"$f":"IF(Datenausgabe!G1,G70+IF(Datenausgabe!G14,G71,0),0)","v":0},{"$f":"IF(Datenausgabe!H1,H70+IF(Datenausgabe!H14,H71,0),0)","v":0},{"$f":"IF(Datenausgabe!I1,I70+IF(Datenausgabe!I14,I71,0),0)","v":0},{"$f":"IF(Datenausgabe!J1,J70+IF(Datenausgabe!J14,J71,0),0)","v":0},{"$f":"IF(Datenausgabe!K1,K70+IF(Datenausgabe!K14,K71,0),0)","v":0},{"$f":"IF(Datenausgabe!L1,L70+IF(Datenausgabe!L14,L71,0),0)","v":0},{"$f":"IF(Datenausgabe!M1,M70+IF(Datenausgabe!M14,M71,0),0)","v":0}]
["Ermittlung der Werte für die VL Zulage"]
["VL Betrag",{"$f":"Datenausgabe!B46","v":6.65},{"$f":"Datenausgabe!C46","v":6.65},{"$f":"Datenausgabe!D46","v":6.65},{"$f":"Datenausgabe!E46","v":6.65},{"$f":"Datenausgabe!F46","v":6.65},{"$f":"Datenausgabe!G46","v":6.65},{"$f":"Datenausgabe!H46","v":6.65},{"$f":"Datenausgabe!I46","v":6.65},{"$f":"Datenausgabe!J46","v":6.65},{"$f":"Datenausgabe!K46","v":6.65},{"$f":"Datenausgabe!L46","v":6.65},{"$f":"Datenausgabe!M46","v":6.65}]
["VL TZ Klassif.",{"$f":"VALUE(MID(Arbeitgeberkosten!$E$14,5,1))","v":4}," 1 = Teilzeit & Tage ' 2 = ungekürzt' 3 = Tage-Kürzung' 4 = Teilzeit-Kürzung"]
["VL TZ 1",{"$f":"B74*IF($B$75=1,Datenausgabe!B20/Datenausgabe!B21*Datenausgabe!B22/Datenausgabe!B26,1)*IF($B$75=2,1,1)*IF($B$75=3,Datenausgabe!B22/Datenausgabe!B26,1)*IF($B$75=4,Datenausgabe!B20/Datenausgabe!B21,1)","v":6.65},{"$f":"C74*IF($B$75=1,Datenausgabe!C20/Datenausgabe!C21*Datenausgabe!C22/Datenausgabe!C26,1)*IF($B$75=2,1,1)*IF($B$75=3,Datenausgabe!C22/Datenausgabe!C26,1)*IF($B$75=4,Datenausgabe!C20/Datenausgabe!C21,1)","v":6.65},{"$f":"D74*IF($B$75=1,Datenausgabe!D20/Datenausgabe!D21*Datenausgabe!D22/Datenausgabe!D26,1)*IF($B$75=2,1,1)*IF($B$75=3,Datenausgabe!D22/Datenausgabe!D26,1)*IF($B$75=4,Datenausgabe!D20/Datenausgabe!D21,1)","v":6.65},{"$f":"E74*IF($B$75=1,Datenausgabe!E20/Datenausgabe!E21*Datenausgabe!E22/Datenausgabe!E26,1)*IF($B$75=2,1,1)*IF($B$75=3,Datenausgabe!E22/Datenausgabe!E26,1)*IF($B$75=4,Datenausgabe!E20/Datenausgabe!E21,1)","v":6.65},{"$f":"F74*IF($B$75=1,Datenausgabe!F20/Datenausgabe!F21*Datenausgabe!F22/Datenausgabe!F26,1)*IF($B$75=2,1,1)*IF($B$75=3,Datenausgabe!F22/Datenausgabe!F26,1)*IF($B$75=4,Datenausgabe!F20/Datenausgabe!F21,1)","v":6.65},{"$f":"G74*IF($B$75=1,Datenausgabe!G20/Datenausgabe!G21*Datenausgabe!G22/Datenausgabe!G26,1)*IF($B$75=2,1,1)*IF($B$75=3,Datenausgabe!G22/Datenausgabe!G26,1)*IF($B$75=4,Datenausgabe!G20/Datenausgabe!G21,1)","v":6.65},{"$f":"H74*IF($B$75=1,Datenausgabe!H20/Datenausgabe!H21*Datenausgabe!H22/Datenausgabe!H26,1)*IF($B$75=2,1,1)*IF($B$75=3,Datenausgabe!H22/Datenausgabe!H26,1)*IF($B$75=4,Datenausgabe!H20/Datenausgabe!H21,1)","v":6.65},{"$f":"I74*IF($B$75=1,Datenausgabe!I20/Datenausgabe!I21*Datenausgabe!I22/Datenausgabe!I26,1)*IF($B$75=2,1,1)*IF($B$75=3,Datenausgabe!I22/Datenausgabe!I26,1)*IF($B$75=4,Datenausgabe!I20/Datenausgabe!I21,1)","v":6.65},{"$f":"J74*IF($B$75=1,Datenausgabe!J20/Datenausgabe!J21*Datenausgabe!J22/Datenausgabe!J26,1)*IF($B$75=2,1,1)*IF($B$75=3,Datenausgabe!J22/Datenausgabe!J26,1)*IF($B$75=4,Datenausgabe!J20/Datenausgabe!J21,1)","v":6.65},{"$f":"K74*IF($B$75=1,Datenausgabe!K20/Datenausgabe!K21*Datenausgabe!K22/Datenausgabe!K26,1)*IF($B$75=2,1,1)*IF($B$75=3,Datenausgabe!K22/Datenausgabe!K26,1)*IF($B$75=4,Datenausgabe!K20/Datenausgabe!K21,1)","v":6.65},{"$f":"L74*IF($B$75=1,Datenausgabe!L20/Datenausgabe!L21*Datenausgabe!L22/Datenausgabe!L26,1)*IF($B$75=2,1,1)*IF($B$75=3,Datenausgabe!L22/Datenausgabe!L26,1)*IF($B$75=4,Datenausgabe!L20/Datenausgabe!L21,1)","v":6.65},{"$f":"M74*IF($B$75=1,Datenausgabe!M20/Datenausgabe!M21*Datenausgabe!M22/Datenausgabe!M26,1)*IF($B$75=2,1,1)*IF($B$75=3,Datenausgabe!M22/Datenausgabe!M26,1)*IF($B$75=4,Datenausgabe!M20/Datenausgabe!M21,1)","v":6.65}]
["VL TZ 2",{"$f":"B74*IF($B$75=1,Datenausgabe!B23/Datenausgabe!B24*Datenausgabe!B25/Datenausgabe!B26,1)*IF($B$75=2,1,1)*IF($B$75=3,Datenausgabe!B25/Datenausgabe!B26,1)*IF($B$75=4,Datenausgabe!B23/Datenausgabe!B24,1)*IF(Datenausgabe!B15,0,1)","v":6.65},{"$f":"C74*IF($B$75=1,Datenausgabe!C23/Datenausgabe!C24*Datenausgabe!C25/Datenausgabe!C26,1)*IF($B$75=2,1,1)*IF($B$75=3,Datenausgabe!C25/Datenausgabe!C26,1)*IF($B$75=4,Datenausgabe!C23/Datenausgabe!C24,1)*IF(Datenausgabe!C15,0,1)","v":6.65},{"$f":"D74*IF($B$75=1,Datenausgabe!D23/Datenausgabe!D24*Datenausgabe!D25/Datenausgabe!D26,1)*IF($B$75=2,1,1)*IF($B$75=3,Datenausgabe!D25/Datenausgabe!D26,1)*IF($B$75=4,Datenausgabe!D23/Datenausgabe!D24,1)*IF(Datenausgabe!D15,0,1)","v":6.65},{"$f":"E74*IF($B$75=1,Datenausgabe!E23/Datenausgabe!E24*Datenausgabe!E25/Datenausgabe!E26,1)*IF($B$75=2,1,1)*IF($B$75=3,Datenausgabe!E25/Datenausgabe!E26,1)*IF($B$75=4,Datenausgabe!E23/Datenausgabe!E24,1)*IF(Datenausgabe!E15,0,1)","v":6.65},{"$f":"F74*IF($B$75=1,Datenausgabe!F23/Datenausgabe!F24*Datenausgabe!F25/Datenausgabe!F26,1)*IF($B$75=2,1,1)*IF($B$75=3,Datenausgabe!F25/Datenausgabe!F26,1)*IF($B$75=4,Datenausgabe!F23/Datenausgabe!F24,1)*IF(Datenausgabe!F15,0,1)","v":6.65},{"$f":"G74*IF($B$75=1,Datenausgabe!G23/Datenausgabe!G24*Datenausgabe!G25/Datenausgabe!G26,1)*IF($B$75=2,1,1)*IF($B$75=3,Datenausgabe!G25/Datenausgabe!G26,1)*IF($B$75=4,Datenausgabe!G23/Datenausgabe!G24,1)*IF(Datenausgabe!G15,0,1)","v":6.65},{"$f":"H74*IF($B$75=1,Datenausgabe!H23/Datenausgabe!H24*Datenausgabe!H25/Datenausgabe!H26,1)*IF($B$75=2,1,1)*IF($B$75=3,Datenausgabe!H25/Datenausgabe!H26,1)*IF($B$75=4,Datenausgabe!H23/Datenausgabe!H24,1)*IF(Datenausgabe!H15,0,1)","v":6.65},{"$f":"I74*IF($B$75=1,Datenausgabe!I23/Datenausgabe!I24*Datenausgabe!I25/Datenausgabe!I26,1)*IF($B$75=2,1,1)*IF($B$75=3,Datenausgabe!I25/Datenausgabe!I26,1)*IF($B$75=4,Datenausgabe!I23/Datenausgabe!I24,1)*IF(Datenausgabe!I15,0,1)","v":6.65},{"$f":"J74*IF($B$75=1,Datenausgabe!J23/Datenausgabe!J24*Datenausgabe!J25/Datenausgabe!J26,1)*IF($B$75=2,1,1)*IF($B$75=3,Datenausgabe!J25/Datenausgabe!J26,1)*IF($B$75=4,Datenausgabe!J23/Datenausgabe!J24,1)*IF(Datenausgabe!J15,0,1)","v":6.65},{"$f":"K74*IF($B$75=1,Datenausgabe!K23/Datenausgabe!K24*Datenausgabe!K25/Datenausgabe!K26,1)*IF($B$75=2,1,1)*IF($B$75=3,Datenausgabe!K25/Datenausgabe!K26,1)*IF($B$75=4,Datenausgabe!K23/Datenausgabe!K24,1)*IF(Datenausgabe!K15,0,1)","v":6.65},{"$f":"L74*IF($B$75=1,Datenausgabe!L23/Datenausgabe!L24*Datenausgabe!L25/Datenausgabe!L26,1)*IF($B$75=2,1,1)*IF($B$75=3,Datenausgabe!L25/Datenausgabe!L26,1)*IF($B$75=4,Datenausgabe!L23/Datenausgabe!L24,1)*IF(Datenausgabe!L15,0,1)","v":6.65},{"$f":"M74*IF($B$75=1,Datenausgabe!M23/Datenausgabe!M24*Datenausgabe!M25/Datenausgabe!M26,1)*IF($B$75=2,1,1)*IF($B$75=3,Datenausgabe!M25/Datenausgabe!M26,1)*IF($B$75=4,Datenausgabe!M23/Datenausgabe!M24,1)*IF(Datenausgabe!M15,0,1)","v":6.65}]
["VL Ergebnis",{"$f":"IF(IF(Datenausgabe!B1,B76+IF(Datenausgabe!B14,B77,0),0)>B74,B74,IF(Datenausgabe!B1,B76+IF(Datenausgabe!B14,B77,0),0))","v":6.65},{"$f":"IF(IF(Datenausgabe!C1,C76+IF(Datenausgabe!C14,C77,0),0)>C74,C74,IF(Datenausgabe!C1,C76+IF(Datenausgabe!C14,C77,0),0))","v":6.65},{"$f":"IF(IF(Datenausgabe!D1,D76+IF(Datenausgabe!D14,D77,0),0)>D74,D74,IF(Datenausgabe!D1,D76+IF(Datenausgabe!D14,D77,0),0))","v":6.65},{"$f":"IF(IF(Datenausgabe!E1,E76+IF(Datenausgabe!E14,E77,0),0)>E74,E74,IF(Datenausgabe!E1,E76+IF(Datenausgabe!E14,E77,0),0))","v":6.65},{"$f":"IF(IF(Datenausgabe!F1,F76+IF(Datenausgabe!F14,F77,0),0)>F74,F74,IF(Datenausgabe!F1,F76+IF(Datenausgabe!F14,F77,0),0))","v":6.65},{"$f":"IF(IF(Datenausgabe!G1,G76+IF(Datenausgabe!G14,G77,0),0)>G74,G74,IF(Datenausgabe!G1,G76+IF(Datenausgabe!G14,G77,0),0))","v":6.65},{"$f":"IF(IF(Datenausgabe!H1,H76+IF(Datenausgabe!H14,H77,0),0)>H74,H74,IF(Datenausgabe!H1,H76+IF(Datenausgabe!H14,H77,0),0))","v":6.65},{"$f":"IF(IF(Datenausgabe!I1,I76+IF(Datenausgabe!I14,I77,0),0)>I74,I74,IF(Datenausgabe!I1,I76+IF(Datenausgabe!I14,I77,0),0))","v":6.65},{"$f":"IF(IF(Datenausgabe!J1,J76+IF(Datenausgabe!J14,J77,0),0)>J74,J74,IF(Datenausgabe!J1,J76+IF(Datenausgabe!J14,J77,0),0))","v":6.65},{"$f":"IF(IF(Datenausgabe!K1,K76+IF(Datenausgabe!K14,K77,0),0)>K74,K74,IF(Datenausgabe!K1,K76+IF(Datenausgabe!K14,K77,0),0))","v":6.65},{"$f":"IF(IF(Datenausgabe!L1,L76+IF(Datenausgabe!L14,L77,0),0)>L74,L74,IF(Datenausgabe!L1,L76+IF(Datenausgabe!L14,L77,0),0))","v":6.65},{"$f":"IF(IF(Datenausgabe!M1,M76+IF(Datenausgabe!M14,M77,0),0)>M74,M74,IF(Datenausgabe!M1,M76+IF(Datenausgabe!M14,M77,0),0))","v":6.65}]
["Zulage 1"]
["eingegebener Betrag",{"$f":"Datenausgabe!B52","v":0},{"$f":"Datenausgabe!C52","v":0},{"$f":"Datenausgabe!D52","v":0},{"$f":"Datenausgabe!E52","v":0},{"$f":"Datenausgabe!F52","v":0},{"$f":"Datenausgabe!G52","v":0},{"$f":"Datenausgabe!H52","v":0},{"$f":"Datenausgabe!I52","v":0},{"$f":"Datenausgabe!J52","v":0},{"$f":"Datenausgabe!K52","v":0},{"$f":"Datenausgabe!L52","v":0},{"$f":"Datenausgabe!M52","v":0}]
["Zulage TZ Klass",{"$f":"IF(Arbeitgeberkosten!$E$15<>\"\",VALUE(MID(Arbeitgeberkosten!$E$15,5,1)),1)","v":1}," 1 = Teilzeit & Tage ' 2 = ungekürzt' 3 = Tage-Kürzung' 4 = Teilzeit-Kürzung"]
["TZ Betrag 1",{"$f":"B80*IF($B$81=1,Datenausgabe!B20/Datenausgabe!B21*Datenausgabe!B22/Datenausgabe!B26,1)*IF($B$81=2,1,1)*IF($B$81=3,Datenausgabe!B22/Datenausgabe!B26,1)*IF($B$81=4,Datenausgabe!B20/Datenausgabe!B21,1)","v":0},{"$f":"C80*IF($B$81=1,Datenausgabe!C20/Datenausgabe!C21*Datenausgabe!C22/Datenausgabe!C26,1)*IF($B$81=2,1,1)*IF($B$81=3,Datenausgabe!C22/Datenausgabe!C26,1)*IF($B$81=4,Datenausgabe!C20/Datenausgabe!C21,1)","v":0},{"$f":"D80*IF($B$81=1,Datenausgabe!D20/Datenausgabe!D21*Datenausgabe!D22/Datenausgabe!D26,1)*IF($B$81=2,1,1)*IF($B$81=3,Datenausgabe!D22/Datenausgabe!D26,1)*IF($B$81=4,Datenausgabe!D20/Datenausgabe!D21,1)","v":0},{"$f":"E80*IF($B$81=1,Datenausgabe!E20/Datenausgabe!E21*Datenausgabe!E22/Datenausgabe!E26,1)*IF($B$81=2,1,1)*IF($B$81=3,Datenausgabe!E22/Datenausgabe!E26,1)*IF($B$81=4,Datenausgabe!E20/Datenausgabe!E21,1)","v":0},{"$f":"F80*IF($B$81=1,Datenausgabe!F20/Datenausgabe!F21*Datenausgabe!F22/Datenausgabe!F26,1)*IF($B$81=2,1,1)*IF($B$81=3,Datenausgabe!F22/Datenausgabe!F26,1)*IF($B$81=4,Datenausgabe!F20/Datenausgabe!F21,1)","v":0},{"$f":"G80*IF($B$81=1,Datenausgabe!G20/Datenausgabe!G21*Datenausgabe!G22/Datenausgabe!G26,1)*IF($B$81=2,1,1)*IF($B$81=3,Datenausgabe!G22/Datenausgabe!G26,1)*IF($B$81=4,Datenausgabe!G20/Datenausgabe!G21,1)","v":0},{"$f":"H80*IF($B$81=1,Datenausgabe!H20/Datenausgabe!H21*Datenausgabe!H22/Datenausgabe!H26,1)*IF($B$81=2,1,1)*IF($B$81=3,Datenausgabe!H22/Datenausgabe!H26,1)*IF($B$81=4,Datenausgabe!H20/Datenausgabe!H21,1)","v":0},{"$f":"I80*IF($B$81=1,Datenausgabe!I20/Datenausgabe!I21*Datenausgabe!I22/Datenausgabe!I26,1)*IF($B$81=2,1,1)*IF($B$81=3,Datenausgabe!I22/Datenausgabe!I26,1)*IF($B$81=4,Datenausgabe!I20/Datenausgabe!I21,1)","v":0},{"$f":"J80*IF($B$81=1,Datenausgabe!J20/Datenausgabe!J21*Datenausgabe!J22/Datenausgabe!J26,1)*IF($B$81=2,1,1)*IF($B$81=3,Datenausgabe!J22/Datenausgabe!J26,1)*IF($B$81=4,Datenausgabe!J20/Datenausgabe!J21,1)","v":0},{"$f":"K80*IF($B$81=1,Datenausgabe!K20/Datenausgabe!K21*Datenausgabe!K22/Datenausgabe!K26,1)*IF($B$81=2,1,1)*IF($B$81=3,Datenausgabe!K22/Datenausgabe!K26,1)*IF($B$81=4,Datenausgabe!K20/Datenausgabe!K21,1)","v":0},{"$f":"L80*IF($B$81=1,Datenausgabe!L20/Datenausgabe!L21*Datenausgabe!L22/Datenausgabe!L26,1)*IF($B$81=2,1,1)*IF($B$81=3,Datenausgabe!L22/Datenausgabe!L26,1)*IF($B$81=4,Datenausgabe!L20/Datenausgabe!L21,1)","v":0},{"$f":"M80*IF($B$81=1,Datenausgabe!M20/Datenausgabe!M21*Datenausgabe!M22/Datenausgabe!M26,1)*IF($B$81=2,1,1)*IF($B$81=3,Datenausgabe!M22/Datenausgabe!M26,1)*IF($B$81=4,Datenausgabe!M20/Datenausgabe!M21,1)","v":0}]
["TZ Betrag 2",{"$f":"B80*IF($B$81=1,Datenausgabe!B23/Datenausgabe!B24*Datenausgabe!B25/Datenausgabe!B26,1)*IF($B$81=2,1,1)*IF($B$81=3,Datenausgabe!B25/Datenausgabe!B26,1)*IF($B$81=4,Datenausgabe!B23/Datenausgabe!B24,1)","v":0},{"$f":"C80*IF($B$81=1,Datenausgabe!C23/Datenausgabe!C24*Datenausgabe!C25/Datenausgabe!C26,1)*IF($B$81=2,1,1)*IF($B$81=3,Datenausgabe!C25/Datenausgabe!C26,1)*IF($B$81=4,Datenausgabe!C23/Datenausgabe!C24,1)","v":0},{"$f":"D80*IF($B$81=1,Datenausgabe!D23/Datenausgabe!D24*Datenausgabe!D25/Datenausgabe!D26,1)*IF($B$81=2,1,1)*IF($B$81=3,Datenausgabe!D25/Datenausgabe!D26,1)*IF($B$81=4,Datenausgabe!D23/Datenausgabe!D24,1)","v":0},{"$f":"E80*IF($B$81=1,Datenausgabe!E23/Datenausgabe!E24*Datenausgabe!E25/Datenausgabe!E26,1)*IF($B$81=2,1,1)*IF($B$81=3,Datenausgabe!E25/Datenausgabe!E26,1)*IF($B$81=4,Datenausgabe!E23/Datenausgabe!E24,1)","v":0},{"$f":"F80*IF($B$81=1,Datenausgabe!F23/Datenausgabe!F24*Datenausgabe!F25/Datenausgabe!F26,1)*IF($B$81=2,1,1)*IF($B$81=3,Datenausgabe!F25/Datenausgabe!F26,1)*IF($B$81=4,Datenausgabe!F23/Datenausgabe!F24,1)","v":0},{"$f":"G80*IF($B$81=1,Datenausgabe!G23/Datenausgabe!G24*Datenausgabe!G25/Datenausgabe!G26,1)*IF($B$81=2,1,1)*IF($B$81=3,Datenausgabe!G25/Datenausgabe!G26,1)*IF($B$81=4,Datenausgabe!G23/Datenausgabe!G24,1)","v":0},{"$f":"H80*IF($B$81=1,Datenausgabe!H23/Datenausgabe!H24*Datenausgabe!H25/Datenausgabe!H26,1)*IF($B$81=2,1,1)*IF($B$81=3,Datenausgabe!H25/Datenausgabe!H26,1)*IF($B$81=4,Datenausgabe!H23/Datenausgabe!H24,1)","v":0},{"$f":"I80*IF($B$81=1,Datenausgabe!I23/Datenausgabe!I24*Datenausgabe!I25/Datenausgabe!I26,1)*IF($B$81=2,1,1)*IF($B$81=3,Datenausgabe!I25/Datenausgabe!I26,1)*IF($B$81=4,Datenausgabe!I23/Datenausgabe!I24,1)","v":0},{"$f":"J80*IF($B$81=1,Datenausgabe!J23/Datenausgabe!J24*Datenausgabe!J25/Datenausgabe!J26,1)*IF($B$81=2,1,1)*IF($B$81=3,Datenausgabe!J25/Datenausgabe!J26,1)*IF($B$81=4,Datenausgabe!J23/Datenausgabe!J24,1)","v":0},{"$f":"K80*IF($B$81=1,Datenausgabe!K23/Datenausgabe!K24*Datenausgabe!K25/Datenausgabe!K26,1)*IF($B$81=2,1,1)*IF($B$81=3,Datenausgabe!K25/Datenausgabe!K26,1)*IF($B$81=4,Datenausgabe!K23/Datenausgabe!K24,1)","v":0},{"$f":"L80*IF($B$81=1,Datenausgabe!L23/Datenausgabe!L24*Datenausgabe!L25/Datenausgabe!L26,1)*IF($B$81=2,1,1)*IF($B$81=3,Datenausgabe!L25/Datenausgabe!L26,1)*IF($B$81=4,Datenausgabe!L23/Datenausgabe!L24,1)","v":0},{"$f":"M80*IF($B$81=1,Datenausgabe!M23/Datenausgabe!M24*Datenausgabe!M25/Datenausgabe!M26,1)*IF($B$81=2,1,1)*IF($B$81=3,Datenausgabe!M25/Datenausgabe!M26,1)*IF($B$81=4,Datenausgabe!M23/Datenausgabe!M24,1)","v":0}]
["Zulage Ergebnis",{"$f":"IF(Datenausgabe!B1,B82+IF(AND(Datenausgabe!B15,Datenausgabe!B14),B83,0),0)","v":0},{"$f":"IF(Datenausgabe!C1,C82+IF(AND(Datenausgabe!C15,Datenausgabe!C14),C83,0),0)","v":0},{"$f":"IF(Datenausgabe!D1,D82+IF(AND(Datenausgabe!D15,Datenausgabe!D14),D83,0),0)","v":0},{"$f":"IF(Datenausgabe!E1,E82+IF(AND(Datenausgabe!E15,Datenausgabe!E14),E83,0),0)","v":0},{"$f":"IF(Datenausgabe!F1,F82+IF(AND(Datenausgabe!F15,Datenausgabe!F14),F83,0),0)","v":0},{"$f":"IF(Datenausgabe!G1,G82+IF(AND(Datenausgabe!G15,Datenausgabe!G14),G83,0),0)","v":0},{"$f":"IF(Datenausgabe!H1,H82+IF(AND(Datenausgabe!H15,Datenausgabe!H14),H83,0),0)","v":0},{"$f":"IF(Datenausgabe!I1,I82+IF(AND(Datenausgabe!I15,Datenausgabe!I14),I83,0),0)","v":0},{"$f":"IF(Datenausgabe!J1,J82+IF(AND(Datenausgabe!J15,Datenausgabe!J14),J83,0),0)","v":0},{"$f":"IF(Datenausgabe!K1,K82+IF(AND(Datenausgabe!K15,Datenausgabe!K14),K83,0),0)","v":0},{"$f":"IF(Datenausgabe!L1,L82+IF(AND(Datenausgabe!L15,Datenausgabe!L14),L83,0),0)","v":0},{"$f":"IF(Datenausgabe!M1,M82+IF(AND(Datenausgabe!M15,Datenausgabe!M14),M83,0),0)","v":0}]
["Zulage 2"]
["eingegebener Betrag",{"$f":"Datenausgabe!B53","v":0},{"$f":"Datenausgabe!C53","v":0},{"$f":"Datenausgabe!D53","v":0},{"$f":"Datenausgabe!E53","v":0},{"$f":"Datenausgabe!F53","v":0},{"$f":"Datenausgabe!G53","v":0},{"$f":"Datenausgabe!H53","v":0},{"$f":"Datenausgabe!I53","v":0},{"$f":"Datenausgabe!J53","v":0},{"$f":"Datenausgabe!K53","v":0},{"$f":"Datenausgabe!L53","v":0},{"$f":"Datenausgabe!M53","v":0}]
["Zulage TZ Klass",{"$f":"IF(Arbeitgeberkosten!$E$16<>\"\",VALUE(MID(Arbeitgeberkosten!$E$16,5,1)),1)","v":1}," 1 = Teilzeit & Tage ' 2 = ungekürzt' 3 = Tage-Kürzung' 4 = Teilzeit-Kürzung"]
["TZ Betrag 1",{"$f":"B86*IF($B$87=1,Datenausgabe!B20/Datenausgabe!B21*Datenausgabe!B22/Datenausgabe!B26,1)*IF($B$87=2,1,1)*IF($B$87=3,Datenausgabe!B22/Datenausgabe!B26,1)*IF($B$87=4,Datenausgabe!B20/Datenausgabe!B21,1)","v":0},{"$f":"C86*IF($B$87=1,Datenausgabe!C20/Datenausgabe!C21*Datenausgabe!C22/Datenausgabe!C26,1)*IF($B$87=2,1,1)*IF($B$87=3,Datenausgabe!C22/Datenausgabe!C26,1)*IF($B$87=4,Datenausgabe!C20/Datenausgabe!C21,1)","v":0},{"$f":"D86*IF($B$87=1,Datenausgabe!D20/Datenausgabe!D21*Datenausgabe!D22/Datenausgabe!D26,1)*IF($B$87=2,1,1)*IF($B$87=3,Datenausgabe!D22/Datenausgabe!D26,1)*IF($B$87=4,Datenausgabe!D20/Datenausgabe!D21,1)","v":0},{"$f":"E86*IF($B$87=1,Datenausgabe!E20/Datenausgabe!E21*Datenausgabe!E22/Datenausgabe!E26,1)*IF($B$87=2,1,1)*IF($B$87=3,Datenausgabe!E22/Datenausgabe!E26,1)*IF($B$87=4,Datenausgabe!E20/Datenausgabe!E21,1)","v":0},{"$f":"F86*IF($B$87=1,Datenausgabe!F20/Datenausgabe!F21*Datenausgabe!F22/Datenausgabe!F26,1)*IF($B$87=2,1,1)*IF($B$87=3,Datenausgabe!F22/Datenausgabe!F26,1)*IF($B$87=4,Datenausgabe!F20/Datenausgabe!F21,1)","v":0},{"$f":"G86*IF($B$87=1,Datenausgabe!G20/Datenausgabe!G21*Datenausgabe!G22/Datenausgabe!G26,1)*IF($B$87=2,1,1)*IF($B$87=3,Datenausgabe!G22/Datenausgabe!G26,1)*IF($B$87=4,Datenausgabe!G20/Datenausgabe!G21,1)","v":0},{"$f":"H86*IF($B$87=1,Datenausgabe!H20/Datenausgabe!H21*Datenausgabe!H22/Datenausgabe!H26,1)*IF($B$87=2,1,1)*IF($B$87=3,Datenausgabe!H22/Datenausgabe!H26,1)*IF($B$87=4,Datenausgabe!H20/Datenausgabe!H21,1)","v":0},{"$f":"I86*IF($B$87=1,Datenausgabe!I20/Datenausgabe!I21*Datenausgabe!I22/Datenausgabe!I26,1)*IF($B$87=2,1,1)*IF($B$87=3,Datenausgabe!I22/Datenausgabe!I26,1)*IF($B$87=4,Datenausgabe!I20/Datenausgabe!I21,1)","v":0},{"$f":"J86*IF($B$87=1,Datenausgabe!J20/Datenausgabe!J21*Datenausgabe!J22/Datenausgabe!J26,1)*IF($B$87=2,1,1)*IF($B$87=3,Datenausgabe!J22/Datenausgabe!J26,1)*IF($B$87=4,Datenausgabe!J20/Datenausgabe!J21,1)","v":0},{"$f":"K86*IF($B$87=1,Datenausgabe!K20/Datenausgabe!K21*Datenausgabe!K22/Datenausgabe!K26,1)*IF($B$87=2,1,1)*IF($B$87=3,Datenausgabe!K22/Datenausgabe!K26,1)*IF($B$87=4,Datenausgabe!K20/Datenausgabe!K21,1)","v":0},{"$f":"L86*IF($B$87=1,Datenausgabe!L20/Datenausgabe!L21*Datenausgabe!L22/Datenausgabe!L26,1)*IF($B$87=2,1,1)*IF($B$87=3,Datenausgabe!L22/Datenausgabe!L26,1)*IF($B$87=4,Datenausgabe!L20/Datenausgabe!L21,1)","v":0},{"$f":"M86*IF($B$87=1,Datenausgabe!M20/Datenausgabe!M21*Datenausgabe!M22/Datenausgabe!M26,1)*IF($B$87=2,1,1)*IF($B$87=3,Datenausgabe!M22/Datenausgabe!M26,1)*IF($B$87=4,Datenausgabe!M20/Datenausgabe!M21,1)","v":0}]
["TZ Betrag 2",{"$f":"B86*IF($B$87=1,Datenausgabe!B23/Datenausgabe!B24*Datenausgabe!B25/Datenausgabe!B26,1)*IF($B$87=2,1,1)*IF($B$87=3,Datenausgabe!B25/Datenausgabe!B26,1)*IF($B$87=4,Datenausgabe!B23/Datenausgabe!B24,1)","v":0},{"$f":"C86*IF($B$87=1,Datenausgabe!C23/Datenausgabe!C24*Datenausgabe!C25/Datenausgabe!C26,1)*IF($B$87=2,1,1)*IF($B$87=3,Datenausgabe!C25/Datenausgabe!C26,1)*IF($B$87=4,Datenausgabe!C23/Datenausgabe!C24,1)","v":0},{"$f":"D86*IF($B$87=1,Datenausgabe!D23/Datenausgabe!D24*Datenausgabe!D25/Datenausgabe!D26,1)*IF($B$87=2,1,1)*IF($B$87=3,Datenausgabe!D25/Datenausgabe!D26,1)*IF($B$87=4,Datenausgabe!D23/Datenausgabe!D24,1)","v":0},{"$f":"E86*IF($B$87=1,Datenausgabe!E23/Datenausgabe!E24*Datenausgabe!E25/Datenausgabe!E26,1)*IF($B$87=2,1,1)*IF($B$87=3,Datenausgabe!E25/Datenausgabe!E26,1)*IF($B$87=4,Datenausgabe!E23/Datenausgabe!E24,1)","v":0},{"$f":"F86*IF($B$87=1,Datenausgabe!F23/Datenausgabe!F24*Datenausgabe!F25/Datenausgabe!F26,1)*IF($B$87=2,1,1)*IF($B$87=3,Datenausgabe!F25/Datenausgabe!F26,1)*IF($B$87=4,Datenausgabe!F23/Datenausgabe!F24,1)","v":0},{"$f":"G86*IF($B$87=1,Datenausgabe!G23/Datenausgabe!G24*Datenausgabe!G25/Datenausgabe!G26,1)*IF($B$87=2,1,1)*IF($B$87=3,Datenausgabe!G25/Datenausgabe!G26,1)*IF($B$87=4,Datenausgabe!G23/Datenausgabe!G24,1)","v":0},{"$f":"H86*IF($B$87=1,Datenausgabe!H23/Datenausgabe!H24*Datenausgabe!H25/Datenausgabe!H26,1)*IF($B$87=2,1,1)*IF($B$87=3,Datenausgabe!H25/Datenausgabe!H26,1)*IF($B$87=4,Datenausgabe!H23/Datenausgabe!H24,1)","v":0},{"$f":"I86*IF($B$87=1,Datenausgabe!I23/Datenausgabe!I24*Datenausgabe!I25/Datenausgabe!I26,1)*IF($B$87=2,1,1)*IF($B$87=3,Datenausgabe!I25/Datenausgabe!I26,1)*IF($B$87=4,Datenausgabe!I23/Datenausgabe!I24,1)","v":0},{"$f":"J86*IF($B$87=1,Datenausgabe!J23/Datenausgabe!J24*Datenausgabe!J25/Datenausgabe!J26,1)*IF($B$87=2,1,1)*IF($B$87=3,Datenausgabe!J25/Datenausgabe!J26,1)*IF($B$87=4,Datenausgabe!J23/Datenausgabe!J24,1)","v":0},{"$f":"K86*IF($B$87=1,Datenausgabe!K23/Datenausgabe!K24*Datenausgabe!K25/Datenausgabe!K26,1)*IF($B$87=2,1,1)*IF($B$87=3,Datenausgabe!K25/Datenausgabe!K26,1)*IF($B$87=4,Datenausgabe!K23/Datenausgabe!K24,1)","v":0},{"$f":"L86*IF($B$87=1,Datenausgabe!L23/Datenausgabe!L24*Datenausgabe!L25/Datenausgabe!L26,1)*IF($B$87=2,1,1)*IF($B$87=3,Datenausgabe!L25/Datenausgabe!L26,1)*IF($B$87=4,Datenausgabe!L23/Datenausgabe!L24,1)","v":0},{"$f":"M86*IF($B$87=1,Datenausgabe!M23/Datenausgabe!M24*Datenausgabe!M25/Datenausgabe!M26,1)*IF($B$87=2,1,1)*IF($B$87=3,Datenausgabe!M25/Datenausgabe!M26,1)*IF($B$87=4,Datenausgabe!M23/Datenausgabe!M24,1)","v":0}]
["Zulage Ergebnis",{"$f":"IF(Datenausgabe!B1,B88+IF(AND(Datenausgabe!B15,Datenausgabe!B14),B89,0),0)","v":0},{"$f":"IF(Datenausgabe!C1,C88+IF(AND(Datenausgabe!C15,Datenausgabe!C14),C89,0),0)","v":0},{"$f":"IF(Datenausgabe!D1,D88+IF(AND(Datenausgabe!D15,Datenausgabe!D14),D89,0),0)","v":0},{"$f":"IF(Datenausgabe!E1,E88+IF(AND(Datenausgabe!E15,Datenausgabe!E14),E89,0),0)","v":0},{"$f":"IF(Datenausgabe!F1,F88+IF(AND(Datenausgabe!F15,Datenausgabe!F14),F89,0),0)","v":0},{"$f":"IF(Datenausgabe!G1,G88+IF(AND(Datenausgabe!G15,Datenausgabe!G14),G89,0),0)","v":0},{"$f":"IF(Datenausgabe!H1,H88+IF(AND(Datenausgabe!H15,Datenausgabe!H14),H89,0),0)","v":0},{"$f":"IF(Datenausgabe!I1,I88+IF(AND(Datenausgabe!I15,Datenausgabe!I14),I89,0),0)","v":0},{"$f":"IF(Datenausgabe!J1,J88+IF(AND(Datenausgabe!J15,Datenausgabe!J14),J89,0),0)","v":0},{"$f":"IF(Datenausgabe!K1,K88+IF(AND(Datenausgabe!K15,Datenausgabe!K14),K89,0),0)","v":0},{"$f":"IF(Datenausgabe!L1,L88+IF(AND(Datenausgabe!L15,Datenausgabe!L14),L89,0),0)","v":0},{"$f":"IF(Datenausgabe!M1,M88+IF(AND(Datenausgabe!M15,Datenausgabe!M14),M89,0),0)","v":0}]
["Zulage 3"]
["eingegebener Betrag",{"$f":"Datenausgabe!B54","v":0},{"$f":"Datenausgabe!C54","v":0},{"$f":"Datenausgabe!D54","v":0},{"$f":"Datenausgabe!E54","v":0},{"$f":"Datenausgabe!F54","v":0},{"$f":"Datenausgabe!G54","v":0},{"$f":"Datenausgabe!H54","v":0},{"$f":"Datenausgabe!I54","v":0},{"$f":"Datenausgabe!J54","v":0},{"$f":"Datenausgabe!K54","v":0},{"$f":"Datenausgabe!L54","v":0},{"$f":"Datenausgabe!M54","v":0}]
["Zulage TZ Klass",{"$f":"IF(Arbeitgeberkosten!$E$17<>\"\",VALUE(MID(Arbeitgeberkosten!$E$17,5,1)),1)","v":1}," 1 = Teilzeit & Tage ' 2 = ungekürzt' 3 = Tage-Kürzung' 4 = Teilzeit-Kürzung"]
["TZ Betrag 1",{"$f":"B92*IF($B$93=1,Datenausgabe!B20/Datenausgabe!B21*Datenausgabe!B22/Datenausgabe!B26,1)*IF($B$93=2,1,1)*IF($B$93=3,Datenausgabe!B22/Datenausgabe!B26,1)*IF($B$93=4,Datenausgabe!B20/Datenausgabe!B21,1)","v":0},{"$f":"C92*IF($B$93=1,Datenausgabe!C20/Datenausgabe!C21*Datenausgabe!C22/Datenausgabe!C26,1)*IF($B$93=2,1,1)*IF($B$93=3,Datenausgabe!C22/Datenausgabe!C26,1)*IF($B$93=4,Datenausgabe!C20/Datenausgabe!C21,1)","v":0},{"$f":"D92*IF($B$93=1,Datenausgabe!D20/Datenausgabe!D21*Datenausgabe!D22/Datenausgabe!D26,1)*IF($B$93=2,1,1)*IF($B$93=3,Datenausgabe!D22/Datenausgabe!D26,1)*IF($B$93=4,Datenausgabe!D20/Datenausgabe!D21,1)","v":0},{"$f":"E92*IF($B$93=1,Datenausgabe!E20/Datenausgabe!E21*Datenausgabe!E22/Datenausgabe!E26,1)*IF($B$93=2,1,1)*IF($B$93=3,Datenausgabe!E22/Datenausgabe!E26,1)*IF($B$93=4,Datenausgabe!E20/Datenausgabe!E21,1)","v":0},{"$f":"F92*IF($B$93=1,Datenausgabe!F20/Datenausgabe!F21*Datenausgabe!F22/Datenausgabe!F26,1)*IF($B$93=2,1,1)*IF($B$93=3,Datenausgabe!F22/Datenausgabe!F26,1)*IF($B$93=4,Datenausgabe!F20/Datenausgabe!F21,1)","v":0},{"$f":"G92*IF($B$93=1,Datenausgabe!G20/Datenausgabe!G21*Datenausgabe!G22/Datenausgabe!G26,1)*IF($B$93=2,1,1)*IF($B$93=3,Datenausgabe!G22/Datenausgabe!G26,1)*IF($B$93=4,Datenausgabe!G20/Datenausgabe!G21,1)","v":0},{"$f":"H92*IF($B$93=1,Datenausgabe!H20/Datenausgabe!H21*Datenausgabe!H22/Datenausgabe!H26,1)*IF($B$93=2,1,1)*IF($B$93=3,Datenausgabe!H22/Datenausgabe!H26,1)*IF($B$93=4,Datenausgabe!H20/Datenausgabe!H21,1)","v":0},{"$f":"I92*IF($B$93=1,Datenausgabe!I20/Datenausgabe!I21*Datenausgabe!I22/Datenausgabe!I26,1)*IF($B$93=2,1,1)*IF($B$93=3,Datenausgabe!I22/Datenausgabe!I26,1)*IF($B$93=4,Datenausgabe!I20/Datenausgabe!I21,1)","v":0},{"$f":"J92*IF($B$93=1,Datenausgabe!J20/Datenausgabe!J21*Datenausgabe!J22/Datenausgabe!J26,1)*IF($B$93=2,1,1)*IF($B$93=3,Datenausgabe!J22/Datenausgabe!J26,1)*IF($B$93=4,Datenausgabe!J20/Datenausgabe!J21,1)","v":0},{"$f":"K92*IF($B$93=1,Datenausgabe!K20/Datenausgabe!K21*Datenausgabe!K22/Datenausgabe!K26,1)*IF($B$93=2,1,1)*IF($B$93=3,Datenausgabe!K22/Datenausgabe!K26,1)*IF($B$93=4,Datenausgabe!K20/Datenausgabe!K21,1)","v":0},{"$f":"L92*IF($B$93=1,Datenausgabe!L20/Datenausgabe!L21*Datenausgabe!L22/Datenausgabe!L26,1)*IF($B$93=2,1,1)*IF($B$93=3,Datenausgabe!L22/Datenausgabe!L26,1)*IF($B$93=4,Datenausgabe!L20/Datenausgabe!L21,1)","v":0},{"$f":"M92*IF($B$93=1,Datenausgabe!M20/Datenausgabe!M21*Datenausgabe!M22/Datenausgabe!M26,1)*IF($B$93=2,1,1)*IF($B$93=3,Datenausgabe!M22/Datenausgabe!M26,1)*IF($B$93=4,Datenausgabe!M20/Datenausgabe!M21,1)","v":0}]
["TZ Betrag 2",{"$f":"B92*IF($B$93=1,Datenausgabe!B23/Datenausgabe!B24*Datenausgabe!B25/Datenausgabe!B26,1)*IF($B$93=2,1,1)*IF($B$93=3,Datenausgabe!B25/Datenausgabe!B26,1)*IF($B$93=4,Datenausgabe!B23/Datenausgabe!B24,1)","v":0},{"$f":"C92*IF($B$93=1,Datenausgabe!C23/Datenausgabe!C24*Datenausgabe!C25/Datenausgabe!C26,1)*IF($B$93=2,1,1)*IF($B$93=3,Datenausgabe!C25/Datenausgabe!C26,1)*IF($B$93=4,Datenausgabe!C23/Datenausgabe!C24,1)","v":0},{"$f":"D92*IF($B$93=1,Datenausgabe!D23/Datenausgabe!D24*Datenausgabe!D25/Datenausgabe!D26,1)*IF($B$93=2,1,1)*IF($B$93=3,Datenausgabe!D25/Datenausgabe!D26,1)*IF($B$93=4,Datenausgabe!D23/Datenausgabe!D24,1)","v":0},{"$f":"E92*IF($B$93=1,Datenausgabe!E23/Datenausgabe!E24*Datenausgabe!E25/Datenausgabe!E26,1)*IF($B$93=2,1,1)*IF($B$93=3,Datenausgabe!E25/Datenausgabe!E26,1)*IF($B$93=4,Datenausgabe!E23/Datenausgabe!E24,1)","v":0},{"$f":"F92*IF($B$93=1,Datenausgabe!F23/Datenausgabe!F24*Datenausgabe!F25/Datenausgabe!F26,1)*IF($B$93=2,1,1)*IF($B$93=3,Datenausgabe!F25/Datenausgabe!F26,1)*IF($B$93=4,Datenausgabe!F23/Datenausgabe!F24,1)","v":0},{"$f":"G92*IF($B$93=1,Datenausgabe!G23/Datenausgabe!G24*Datenausgabe!G25/Datenausgabe!G26,1)*IF($B$93=2,1,1)*IF($B$93=3,Datenausgabe!G25/Datenausgabe!G26,1)*IF($B$93=4,Datenausgabe!G23/Datenausgabe!G24,1)","v":0},{"$f":"H92*IF($B$93=1,Datenausgabe!H23/Datenausgabe!H24*Datenausgabe!H25/Datenausgabe!H26,1)*IF($B$93=2,1,1)*IF($B$93=3,Datenausgabe!H25/Datenausgabe!H26,1)*IF($B$93=4,Datenausgabe!H23/Datenausgabe!H24,1)","v":0},{"$f":"I92*IF($B$93=1,Datenausgabe!I23/Datenausgabe!I24*Datenausgabe!I25/Datenausgabe!I26,1)*IF($B$93=2,1,1)*IF($B$93=3,Datenausgabe!I25/Datenausgabe!I26,1)*IF($B$93=4,Datenausgabe!I23/Datenausgabe!I24,1)","v":0},{"$f":"J92*IF($B$93=1,Datenausgabe!J23/Datenausgabe!J24*Datenausgabe!J25/Datenausgabe!J26,1)*IF($B$93=2,1,1)*IF($B$93=3,Datenausgabe!J25/Datenausgabe!J26,1)*IF($B$93=4,Datenausgabe!J23/Datenausgabe!J24,1)","v":0},{"$f":"K92*IF($B$93=1,Datenausgabe!K23/Datenausgabe!K24*Datenausgabe!K25/Datenausgabe!K26,1)*IF($B$93=2,1,1)*IF($B$93=3,Datenausgabe!K25/Datenausgabe!K26,1)*IF($B$93=4,Datenausgabe!K23/Datenausgabe!K24,1)","v":0},{"$f":"L92*IF($B$93=1,Datenausgabe!L23/Datenausgabe!L24*Datenausgabe!L25/Datenausgabe!L26,1)*IF($B$93=2,1,1)*IF($B$93=3,Datenausgabe!L25/Datenausgabe!L26,1)*IF($B$93=4,Datenausgabe!L23/Datenausgabe!L24,1)","v":0},{"$f":"M92*IF($B$93=1,Datenausgabe!M23/Datenausgabe!M24*Datenausgabe!M25/Datenausgabe!M26,1)*IF($B$93=2,1,1)*IF($B$93=3,Datenausgabe!M25/Datenausgabe!M26,1)*IF($B$93=4,Datenausgabe!M23/Datenausgabe!M24,1)","v":0}]
["Zulage Ergebnis",{"$f":"IF(Datenausgabe!B1,B94+IF(AND(Datenausgabe!B15,Datenausgabe!B14),B95,0),0)","v":0},{"$f":"IF(Datenausgabe!C1,C94+IF(AND(Datenausgabe!C15,Datenausgabe!C14),C95,0),0)","v":0},{"$f":"IF(Datenausgabe!D1,D94+IF(AND(Datenausgabe!D15,Datenausgabe!D14),D95,0),0)","v":0},{"$f":"IF(Datenausgabe!E1,E94+IF(AND(Datenausgabe!E15,Datenausgabe!E14),E95,0),0)","v":0},{"$f":"IF(Datenausgabe!F1,F94+IF(AND(Datenausgabe!F15,Datenausgabe!F14),F95,0),0)","v":0},{"$f":"IF(Datenausgabe!G1,G94+IF(AND(Datenausgabe!G15,Datenausgabe!G14),G95,0),0)","v":0},{"$f":"IF(Datenausgabe!H1,H94+IF(AND(Datenausgabe!H15,Datenausgabe!H14),H95,0),0)","v":0},{"$f":"IF(Datenausgabe!I1,I94+IF(AND(Datenausgabe!I15,Datenausgabe!I14),I95,0),0)","v":0},{"$f":"IF(Datenausgabe!J1,J94+IF(AND(Datenausgabe!J15,Datenausgabe!J14),J95,0),0)","v":0},{"$f":"IF(Datenausgabe!K1,K94+IF(AND(Datenausgabe!K15,Datenausgabe!K14),K95,0),0)","v":0},{"$f":"IF(Datenausgabe!L1,L94+IF(AND(Datenausgabe!L15,Datenausgabe!L14),L95,0),0)","v":0},{"$f":"IF(Datenausgabe!M1,M94+IF(AND(Datenausgabe!M15,Datenausgabe!M14),M95,0),0)","v":0}]
["Zulage 4"]
["eingegebener Betrag",{"$f":"Datenausgabe!B55","v":0},{"$f":"Datenausgabe!C55","v":0},{"$f":"Datenausgabe!D55","v":0},{"$f":"Datenausgabe!E55","v":0},{"$f":"Datenausgabe!F55","v":0},{"$f":"Datenausgabe!G55","v":0},{"$f":"Datenausgabe!H55","v":0},{"$f":"Datenausgabe!I55","v":0},{"$f":"Datenausgabe!J55","v":0},{"$f":"Datenausgabe!K55","v":0},{"$f":"Datenausgabe!L55","v":0},{"$f":"Datenausgabe!M55","v":0}]
["Zulage TZ Klass",{"$f":"IF(Arbeitgeberkosten!$E$18<>\"\",VALUE(MID(Arbeitgeberkosten!$E$18,5,1)),1)","v":1}," 1 = Teilzeit & Tage ' 2 = ungekürzt' 3 = Tage-Kürzung' 4 = Teilzeit-Kürzung"]
["TZ Betrag 1",{"$f":"B98*IF($B$99=1,Datenausgabe!B20/Datenausgabe!B21*Datenausgabe!B22/Datenausgabe!B26,1)*IF($B$99=2,1,1)*IF($B$99=3,Datenausgabe!B22/Datenausgabe!B26,1)*IF($B$99=4,Datenausgabe!B20/Datenausgabe!B21,1)","v":0},{"$f":"C98*IF($B$99=1,Datenausgabe!C20/Datenausgabe!C21*Datenausgabe!C22/Datenausgabe!C26,1)*IF($B$99=2,1,1)*IF($B$99=3,Datenausgabe!C22/Datenausgabe!C26,1)*IF($B$99=4,Datenausgabe!C20/Datenausgabe!C21,1)","v":0},{"$f":"D98*IF($B$99=1,Datenausgabe!D20/Datenausgabe!D21*Datenausgabe!D22/Datenausgabe!D26,1)*IF($B$99=2,1,1)*IF($B$99=3,Datenausgabe!D22/Datenausgabe!D26,1)*IF($B$99=4,Datenausgabe!D20/Datenausgabe!D21,1)","v":0},{"$f":"E98*IF($B$99=1,Datenausgabe!E20/Datenausgabe!E21*Datenausgabe!E22/Datenausgabe!E26,1)*IF($B$99=2,1,1)*IF($B$99=3,Datenausgabe!E22/Datenausgabe!E26,1)*IF($B$99=4,Datenausgabe!E20/Datenausgabe!E21,1)","v":0},{"$f":"F98*IF($B$99=1,Datenausgabe!F20/Datenausgabe!F21*Datenausgabe!F22/Datenausgabe!F26,1)*IF($B$99=2,1,1)*IF($B$99=3,Datenausgabe!F22/Datenausgabe!F26,1)*IF($B$99=4,Datenausgabe!F20/Datenausgabe!F21,1)","v":0},{"$f":"G98*IF($B$99=1,Datenausgabe!G20/Datenausgabe!G21*Datenausgabe!G22/Datenausgabe!G26,1)*IF($B$99=2,1,1)*IF($B$99=3,Datenausgabe!G22/Datenausgabe!G26,1)*IF($B$99=4,Datenausgabe!G20/Datenausgabe!G21,1)","v":0},{"$f":"H98*IF($B$99=1,Datenausgabe!H20/Datenausgabe!H21*Datenausgabe!H22/Datenausgabe!H26,1)*IF($B$99=2,1,1)*IF($B$99=3,Datenausgabe!H22/Datenausgabe!H26,1)*IF($B$99=4,Datenausgabe!H20/Datenausgabe!H21,1)","v":0},{"$f":"I98*IF($B$99=1,Datenausgabe!I20/Datenausgabe!I21*Datenausgabe!I22/Datenausgabe!I26,1)*IF($B$99=2,1,1)*IF($B$99=3,Datenausgabe!I22/Datenausgabe!I26,1)*IF($B$99=4,Datenausgabe!I20/Datenausgabe!I21,1)","v":0},{"$f":"J98*IF($B$99=1,Datenausgabe!J20/Datenausgabe!J21*Datenausgabe!J22/Datenausgabe!J26,1)*IF($B$99=2,1,1)*IF($B$99=3,Datenausgabe!J22/Datenausgabe!J26,1)*IF($B$99=4,Datenausgabe!J20/Datenausgabe!J21,1)","v":0},{"$f":"K98*IF($B$99=1,Datenausgabe!K20/Datenausgabe!K21*Datenausgabe!K22/Datenausgabe!K26,1)*IF($B$99=2,1,1)*IF($B$99=3,Datenausgabe!K22/Datenausgabe!K26,1)*IF($B$99=4,Datenausgabe!K20/Datenausgabe!K21,1)","v":0},{"$f":"L98*IF($B$99=1,Datenausgabe!L20/Datenausgabe!L21*Datenausgabe!L22/Datenausgabe!L26,1)*IF($B$99=2,1,1)*IF($B$99=3,Datenausgabe!L22/Datenausgabe!L26,1)*IF($B$99=4,Datenausgabe!L20/Datenausgabe!L21,1)","v":0},{"$f":"M98*IF($B$99=1,Datenausgabe!M20/Datenausgabe!M21*Datenausgabe!M22/Datenausgabe!M26,1)*IF($B$99=2,1,1)*IF($B$99=3,Datenausgabe!M22/Datenausgabe!M26,1)*IF($B$99=4,Datenausgabe!M20/Datenausgabe!M21,1)","v":0}]
["TZ Betrag 2",{"$f":"B98*IF($B$99=1,Datenausgabe!B23/Datenausgabe!B24*Datenausgabe!B25/Datenausgabe!B26,1)*IF($B$99=2,1,1)*IF($B$99=3,Datenausgabe!B25/Datenausgabe!B26,1)*IF($B$99=4,Datenausgabe!B23/Datenausgabe!B24,1)","v":0},{"$f":"C98*IF($B$99=1,Datenausgabe!C23/Datenausgabe!C24*Datenausgabe!C25/Datenausgabe!C26,1)*IF($B$99=2,1,1)*IF($B$99=3,Datenausgabe!C25/Datenausgabe!C26,1)*IF($B$99=4,Datenausgabe!C23/Datenausgabe!C24,1)","v":0},{"$f":"D98*IF($B$99=1,Datenausgabe!D23/Datenausgabe!D24*Datenausgabe!D25/Datenausgabe!D26,1)*IF($B$99=2,1,1)*IF($B$99=3,Datenausgabe!D25/Datenausgabe!D26,1)*IF($B$99=4,Datenausgabe!D23/Datenausgabe!D24,1)","v":0},{"$f":"E98*IF($B$99=1,Datenausgabe!E23/Datenausgabe!E24*Datenausgabe!E25/Datenausgabe!E26,1)*IF($B$99=2,1,1)*IF($B$99=3,Datenausgabe!E25/Datenausgabe!E26,1)*IF($B$99=4,Datenausgabe!E23/Datenausgabe!E24,1)","v":0},{"$f":"F98*IF($B$99=1,Datenausgabe!F23/Datenausgabe!F24*Datenausgabe!F25/Datenausgabe!F26,1)*IF($B$99=2,1,1)*IF($B$99=3,Datenausgabe!F25/Datenausgabe!F26,1)*IF($B$99=4,Datenausgabe!F23/Datenausgabe!F24,1)","v":0},{"$f":"G98*IF($B$99=1,Datenausgabe!G23/Datenausgabe!G24*Datenausgabe!G25/Datenausgabe!G26,1)*IF($B$99=2,1,1)*IF($B$99=3,Datenausgabe!G25/Datenausgabe!G26,1)*IF($B$99=4,Datenausgabe!G23/Datenausgabe!G24,1)","v":0},{"$f":"H98*IF($B$99=1,Datenausgabe!H23/Datenausgabe!H24*Datenausgabe!H25/Datenausgabe!H26,1)*IF($B$99=2,1,1)*IF($B$99=3,Datenausgabe!H25/Datenausgabe!H26,1)*IF($B$99=4,Datenausgabe!H23/Datenausgabe!H24,1)","v":0},{"$f":"I98*IF($B$99=1,Datenausgabe!I23/Datenausgabe!I24*Datenausgabe!I25/Datenausgabe!I26,1)*IF($B$99=2,1,1)*IF($B$99=3,Datenausgabe!I25/Datenausgabe!I26,1)*IF($B$99=4,Datenausgabe!I23/Datenausgabe!I24,1)","v":0},{"$f":"J98*IF($B$99=1,Datenausgabe!J23/Datenausgabe!J24*Datenausgabe!J25/Datenausgabe!J26,1)*IF($B$99=2,1,1)*IF($B$99=3,Datenausgabe!J25/Datenausgabe!J26,1)*IF($B$99=4,Datenausgabe!J23/Datenausgabe!J24,1)","v":0},{"$f":"K98*IF($B$99=1,Datenausgabe!K23/Datenausgabe!K24*Datenausgabe!K25/Datenausgabe!K26,1)*IF($B$99=2,1,1)*IF($B$99=3,Datenausgabe!K25/Datenausgabe!K26,1)*IF($B$99=4,Datenausgabe!K23/Datenausgabe!K24,1)","v":0},{"$f":"L98*IF($B$99=1,Datenausgabe!L23/Datenausgabe!L24*Datenausgabe!L25/Datenausgabe!L26,1)*IF($B$99=2,1,1)*IF($B$99=3,Datenausgabe!L25/Datenausgabe!L26,1)*IF($B$99=4,Datenausgabe!L23/Datenausgabe!L24,1)","v":0},{"$f":"M98*IF($B$99=1,Datenausgabe!M23/Datenausgabe!M24*Datenausgabe!M25/Datenausgabe!M26,1)*IF($B$99=2,1,1)*IF($B$99=3,Datenausgabe!M25/Datenausgabe!M26,1)*IF($B$99=4,Datenausgabe!M23/Datenausgabe!M24,1)","v":0}]
["Zulage Ergebnis",{"$f":"IF(Datenausgabe!B1,B100+IF(AND(Datenausgabe!B15,Datenausgabe!B14),B101,0),0)","v":0},{"$f":"IF(Datenausgabe!C1,C100+IF(AND(Datenausgabe!C15,Datenausgabe!C14),C101,0),0)","v":0},{"$f":"IF(Datenausgabe!D1,D100+IF(AND(Datenausgabe!D15,Datenausgabe!D14),D101,0),0)","v":0},{"$f":"IF(Datenausgabe!E1,E100+IF(AND(Datenausgabe!E15,Datenausgabe!E14),E101,0),0)","v":0},{"$f":"IF(Datenausgabe!F1,F100+IF(AND(Datenausgabe!F15,Datenausgabe!F14),F101,0),0)","v":0},{"$f":"IF(Datenausgabe!G1,G100+IF(AND(Datenausgabe!G15,Datenausgabe!G14),G101,0),0)","v":0},{"$f":"IF(Datenausgabe!H1,H100+IF(AND(Datenausgabe!H15,Datenausgabe!H14),H101,0),0)","v":0},{"$f":"IF(Datenausgabe!I1,I100+IF(AND(Datenausgabe!I15,Datenausgabe!I14),I101,0),0)","v":0},{"$f":"IF(Datenausgabe!J1,J100+IF(AND(Datenausgabe!J15,Datenausgabe!J14),J101,0),0)","v":0},{"$f":"IF(Datenausgabe!K1,K100+IF(AND(Datenausgabe!K15,Datenausgabe!K14),K101,0),0)","v":0},{"$f":"IF(Datenausgabe!L1,L100+IF(AND(Datenausgabe!L15,Datenausgabe!L14),L101,0),0)","v":0},{"$f":"IF(Datenausgabe!M1,M100+IF(AND(Datenausgabe!M15,Datenausgabe!M14),M101,0),0)","v":0}]
["Urlaubsgeld"]
["Basis-Betrag",{"$f":"IF(Datenausgabe!B66<>0,Datenausgabe!B66,VLOOKUP(Datenausgabe!B$6,[2]!Verguetung,24,0))","v":0},{"$f":"IF(Datenausgabe!C66<>0,Datenausgabe!C66,VLOOKUP(Datenausgabe!C$6,[2]!Verguetung,24,0))","v":0},{"$f":"IF(Datenausgabe!D66<>0,Datenausgabe!D66,VLOOKUP(Datenausgabe!D$6,[3]!Verguetung,24,0))","v":0},{"$f":"IF(Datenausgabe!E66<>0,Datenausgabe!E66,VLOOKUP(Datenausgabe!E$6,[3]!Verguetung,24,0))","v":0},{"$f":"IF(Datenausgabe!F66<>0,Datenausgabe!F66,VLOOKUP(Datenausgabe!F$6,[3]!Verguetung,24,0))","v":0},{"$f":"IF(Datenausgabe!G66<>0,Datenausgabe!G66,VLOOKUP(Datenausgabe!G$6,[3]!Verguetung,24,0))","v":0},{"$f":"IF(Datenausgabe!H66<>0,Datenausgabe!H66,VLOOKUP(Datenausgabe!H$6,[3]!Verguetung,24,0))","v":0},{"$f":"IF(Datenausgabe!I66<>0,Datenausgabe!I66,VLOOKUP(Datenausgabe!I$6,[3]!Verguetung,24,0))","v":0},{"$f":"IF(Datenausgabe!J66<>0,Datenausgabe!J66,VLOOKUP(Datenausgabe!J$6,[3]!Verguetung,24,0))","v":0},{"$f":"IF(Datenausgabe!K66<>0,Datenausgabe!K66,VLOOKUP(Datenausgabe!K$6,[3]!Verguetung,24,0))","v":0},{"$f":"IF(Datenausgabe!L66<>0,Datenausgabe!L66,VLOOKUP(Datenausgabe!L$6,[3]!Verguetung,24,0))","v":0},{"$f":"IF(Datenausgabe!M66<>0,Datenausgabe!M66,VLOOKUP(Datenausgabe!M$6,[3]!Verguetung,24,0))","v":0}]
["Urlaubsgeld TZ Klassif:",{"$f":"IF(Arbeitgeberkosten!$E$19<>\"\",VALUE(MID(Arbeitgeberkosten!$E$19,5,1)),1)","v":1}," 1 = Teilzeit & Tage ' 2 = ungekürzt' 3 = Tage-Kürzung' 4 = Teilzeit-Kürzung"]
["TZ Betrag 1",{"$f":"B104*IF($B$105=1,Datenausgabe!B20/Datenausgabe!B21*Datenausgabe!B22/Datenausgabe!B26,1)*IF($B$105=2,1,1)*IF($B$105=3,Datenausgabe!B22/Datenausgabe!B26,1)*IF($B$105=4,Datenausgabe!B20/Datenausgabe!B21,1)","v":0},{"$f":"C104*IF($B$105=1,Datenausgabe!C20/Datenausgabe!C21*Datenausgabe!C22/Datenausgabe!C26,1)*IF($B$105=2,1,1)*IF($B$105=3,Datenausgabe!C22/Datenausgabe!C26,1)*IF($B$105=4,Datenausgabe!C20/Datenausgabe!C21,1)","v":0},{"$f":"D104*IF($B$105=1,Datenausgabe!D20/Datenausgabe!D21*Datenausgabe!D22/Datenausgabe!D26,1)*IF($B$105=2,1,1)*IF($B$105=3,Datenausgabe!D22/Datenausgabe!D26,1)*IF($B$105=4,Datenausgabe!D20/Datenausgabe!D21,1)","v":0},{"$f":"E104*IF($B$105=1,Datenausgabe!E20/Datenausgabe!E21*Datenausgabe!E22/Datenausgabe!E26,1)*IF($B$105=2,1,1)*IF($B$105=3,Datenausgabe!E22/Datenausgabe!E26,1)*IF($B$105=4,Datenausgabe!E20/Datenausgabe!E21,1)","v":0},{"$f":"F104*IF($B$105=1,Datenausgabe!F20/Datenausgabe!F21*Datenausgabe!F22/Datenausgabe!F26,1)*IF($B$105=2,1,1)*IF($B$105=3,Datenausgabe!F22/Datenausgabe!F26,1)*IF($B$105=4,Datenausgabe!F20/Datenausgabe!F21,1)","v":0},{"$f":"G104*IF($B$105=1,Datenausgabe!G20/Datenausgabe!G21*Datenausgabe!G22/Datenausgabe!G26,1)*IF($B$105=2,1,1)*IF($B$105=3,Datenausgabe!G22/Datenausgabe!G26,1)*IF($B$105=4,Datenausgabe!G20/Datenausgabe!G21,1)","v":0},{"$f":"H104*IF($B$105=1,Datenausgabe!H20/Datenausgabe!H21*Datenausgabe!H22/Datenausgabe!H26,1)*IF($B$105=2,1,1)*IF($B$105=3,Datenausgabe!H22/Datenausgabe!H26,1)*IF($B$105=4,Datenausgabe!H20/Datenausgabe!H21,1)","v":0},{"$f":"I104*IF($B$105=1,Datenausgabe!I20/Datenausgabe!I21*Datenausgabe!I22/Datenausgabe!I26,1)*IF($B$105=2,1,1)*IF($B$105=3,Datenausgabe!I22/Datenausgabe!I26,1)*IF($B$105=4,Datenausgabe!I20/Datenausgabe!I21,1)","v":0},{"$f":"J104*IF($B$105=1,Datenausgabe!J20/Datenausgabe!J21*Datenausgabe!J22/Datenausgabe!J26,1)*IF($B$105=2,1,1)*IF($B$105=3,Datenausgabe!J22/Datenausgabe!J26,1)*IF($B$105=4,Datenausgabe!J20/Datenausgabe!J21,1)","v":0},{"$f":"K104*IF($B$105=1,Datenausgabe!K20/Datenausgabe!K21*Datenausgabe!K22/Datenausgabe!K26,1)*IF($B$105=2,1,1)*IF($B$105=3,Datenausgabe!K22/Datenausgabe!K26,1)*IF($B$105=4,Datenausgabe!K20/Datenausgabe!K21,1)","v":0},{"$f":"L104*IF($B$105=1,Datenausgabe!L20/Datenausgabe!L21*Datenausgabe!L22/Datenausgabe!L26,1)*IF($B$105=2,1,1)*IF($B$105=3,Datenausgabe!L22/Datenausgabe!L26,1)*IF($B$105=4,Datenausgabe!L20/Datenausgabe!L21,1)","v":0},{"$f":"M104*IF($B$105=1,Datenausgabe!M20/Datenausgabe!M21*Datenausgabe!M22/Datenausgabe!M26,1)*IF($B$105=2,1,1)*IF($B$105=3,Datenausgabe!M22/Datenausgabe!M26,1)*IF($B$105=4,Datenausgabe!M20/Datenausgabe!M21,1)","v":0}]
["TZ Betrag 2",{"$f":"B104*IF($B$105=1,Datenausgabe!B23/Datenausgabe!B24*Datenausgabe!B25/Datenausgabe!B26,1)*IF($B$105=2,1,1)*IF($B$105=3,Datenausgabe!B25/Datenausgabe!B26,1)*IF($B$105=4,Datenausgabe!B23/Datenausgabe!B24,1)","v":0},{"$f":"C104*IF($B$105=1,Datenausgabe!C23/Datenausgabe!C24*Datenausgabe!C25/Datenausgabe!C26,1)*IF($B$105=2,1,1)*IF($B$105=3,Datenausgabe!C25/Datenausgabe!C26,1)*IF($B$105=4,Datenausgabe!C23/Datenausgabe!C24,1)","v":0},{"$f":"D104*IF($B$105=1,Datenausgabe!D23/Datenausgabe!D24*Datenausgabe!D25/Datenausgabe!D26,1)*IF($B$105=2,1,1)*IF($B$105=3,Datenausgabe!D25/Datenausgabe!D26,1)*IF($B$105=4,Datenausgabe!D23/Datenausgabe!D24,1)","v":0},{"$f":"E104*IF($B$105=1,Datenausgabe!E23/Datenausgabe!E24*Datenausgabe!E25/Datenausgabe!E26,1)*IF($B$105=2,1,1)*IF($B$105=3,Datenausgabe!E25/Datenausgabe!E26,1)*IF($B$105=4,Datenausgabe!E23/Datenausgabe!E24,1)","v":0},{"$f":"F104*IF($B$105=1,Datenausgabe!F23/Datenausgabe!F24*Datenausgabe!F25/Datenausgabe!F26,1)*IF($B$105=2,1,1)*IF($B$105=3,Datenausgabe!F25/Datenausgabe!F26,1)*IF($B$105=4,Datenausgabe!F23/Datenausgabe!F24,1)","v":0},{"$f":"G104*IF($B$105=1,Datenausgabe!G23/Datenausgabe!G24*Datenausgabe!G25/Datenausgabe!G26,1)*IF($B$105=2,1,1)*IF($B$105=3,Datenausgabe!G25/Datenausgabe!G26,1)*IF($B$105=4,Datenausgabe!G23/Datenausgabe!G24,1)","v":0},{"$f":"H104*IF($B$105=1,Datenausgabe!H23/Datenausgabe!H24*Datenausgabe!H25/Datenausgabe!H26,1)*IF($B$105=2,1,1)*IF($B$105=3,Datenausgabe!H25/Datenausgabe!H26,1)*IF($B$105=4,Datenausgabe!H23/Datenausgabe!H24,1)","v":0},{"$f":"I104*IF($B$105=1,Datenausgabe!I23/Datenausgabe!I24*Datenausgabe!I25/Datenausgabe!I26,1)*IF($B$105=2,1,1)*IF($B$105=3,Datenausgabe!I25/Datenausgabe!I26,1)*IF($B$105=4,Datenausgabe!I23/Datenausgabe!I24,1)","v":0},{"$f":"J104*IF($B$105=1,Datenausgabe!J23/Datenausgabe!J24*Datenausgabe!J25/Datenausgabe!J26,1)*IF($B$105=2,1,1)*IF($B$105=3,Datenausgabe!J25/Datenausgabe!J26,1)*IF($B$105=4,Datenausgabe!J23/Datenausgabe!J24,1)","v":0},{"$f":"K104*IF($B$105=1,Datenausgabe!K23/Datenausgabe!K24*Datenausgabe!K25/Datenausgabe!K26,1)*IF($B$105=2,1,1)*IF($B$105=3,Datenausgabe!K25/Datenausgabe!K26,1)*IF($B$105=4,Datenausgabe!K23/Datenausgabe!K24,1)","v":0},{"$f":"L104*IF($B$105=1,Datenausgabe!L23/Datenausgabe!L24*Datenausgabe!L25/Datenausgabe!L26,1)*IF($B$105=2,1,1)*IF($B$105=3,Datenausgabe!L25/Datenausgabe!L26,1)*IF($B$105=4,Datenausgabe!L23/Datenausgabe!L24,1)","v":0},{"$f":"M104*IF($B$105=1,Datenausgabe!M23/Datenausgabe!M24*Datenausgabe!M25/Datenausgabe!M26,1)*IF($B$105=2,1,1)*IF($B$105=3,Datenausgabe!M25/Datenausgabe!M26,1)*IF($B$105=4,Datenausgabe!M23/Datenausgabe!M24,1)","v":0}]
["Urlaubsgeld Ergebnis",{"$f":"IF(Datenausgabe!B65,B106+IF(AND(Datenausgabe!B14,NOT(Datenausgabe!B15)),Nebenrechnungen!B107,0),0)","v":0},{"$f":"IF(Datenausgabe!C65,C106+IF(AND(Datenausgabe!C14,NOT(Datenausgabe!C15)),Nebenrechnungen!C107,0),0)","v":0},{"$f":"IF(Datenausgabe!D65,D106+IF(AND(Datenausgabe!D14,NOT(Datenausgabe!D15)),Nebenrechnungen!D107,0),0)","v":0},{"$f":"IF(Datenausgabe!E65,E106+IF(AND(Datenausgabe!E14,NOT(Datenausgabe!E15)),Nebenrechnungen!E107,0),0)","v":0},{"$f":"IF(Datenausgabe!F65,F106+IF(AND(Datenausgabe!F14,NOT(Datenausgabe!F15)),Nebenrechnungen!F107,0),0)","v":0},{"$f":"IF(Datenausgabe!G65,G106+IF(AND(Datenausgabe!G14,NOT(Datenausgabe!G15)),Nebenrechnungen!G107,0),0)","v":0},{"$f":"IF(Datenausgabe!H65,H106+IF(AND(Datenausgabe!H14,NOT(Datenausgabe!H15)),Nebenrechnungen!H107,0),0)","v":0},{"$f":"IF(Datenausgabe!I65,I106+IF(AND(Datenausgabe!I14,NOT(Datenausgabe!I15)),Nebenrechnungen!I107,0),0)","v":0},{"$f":"IF(Datenausgabe!J65,J106+IF(AND(Datenausgabe!J14,NOT(Datenausgabe!J15)),Nebenrechnungen!J107,0),0)","v":0},{"$f":"IF(Datenausgabe!K65,K106+IF(AND(Datenausgabe!K14,NOT(Datenausgabe!K15)),Nebenrechnungen!K107,0),0)","v":0},{"$f":"IF(Datenausgabe!L65,L106+IF(AND(Datenausgabe!L14,NOT(Datenausgabe!L15)),Nebenrechnungen!L107,0),0)","v":0},{"$f":"IF(Datenausgabe!M65,M106+IF(AND(Datenausgabe!M14,NOT(Datenausgabe!M15)),Nebenrechnungen!M107,0),0)","v":0}]
["Einmalzahlungen"]
["Tabellenbetrag Tarif 1",{"$f":"VLOOKUP(Datenausgabe!B6,EZVorgaben,Datenausgabe!B$2+1,0)","v":0},{"$f":"VLOOKUP(Datenausgabe!C6,EZVorgaben,Datenausgabe!C$2+1,0)","v":0},{"$f":"VLOOKUP(Datenausgabe!D6,EZVorgaben,Datenausgabe!D$2+1,0)","v":0},{"$f":"VLOOKUP(Datenausgabe!E6,EZVorgaben,Datenausgabe!E$2+1,0)","v":0},{"$f":"VLOOKUP(Datenausgabe!F6,EZVorgaben,Datenausgabe!F$2+1,0)","v":0},{"$f":"VLOOKUP(Datenausgabe!G6,EZVorgaben,Datenausgabe!G$2+1,0)","v":0},{"$f":"VLOOKUP(Datenausgabe!H6,EZVorgaben,Datenausgabe!H$2+1,0)","v":0},{"$f":"VLOOKUP(Datenausgabe!I6,EZVorgaben,Datenausgabe!I$2+1,0)","v":0},{"$f":"VLOOKUP(Datenausgabe!J6,EZVorgaben,Datenausgabe!J$2+1,0)","v":0},{"$f":"VLOOKUP(Datenausgabe!K6,EZVorgaben,Datenausgabe!K$2+1,0)","v":0},{"$f":"VLOOKUP(Datenausgabe!L6,EZVorgaben,Datenausgabe!L$2+1,0)","v":0},{"$f":"VLOOKUP(Datenausgabe!M6,EZVorgaben,Datenausgabe!M$2+1,0)","v":0}]
["Tabellenbetrag Tarif 2",{"$f":"VLOOKUP(Datenausgabe!B7,EZVorgaben,Datenausgabe!B$2+1,0)","v":0},{"$f":"VLOOKUP(Datenausgabe!C7,EZVorgaben,Datenausgabe!C$2+1,0)","v":0},{"$f":"VLOOKUP(Datenausgabe!D7,EZVorgaben,Datenausgabe!D$2+1,0)","v":0},{"$f":"VLOOKUP(Datenausgabe!E7,EZVorgaben,Datenausgabe!E$2+1,0)","v":0},{"$f":"VLOOKUP(Datenausgabe!F7,EZVorgaben,Datenausgabe!F$2+1,0)","v":0},{"$f":"VLOOKUP(Datenausgabe!G7,EZVorgaben,Datenausgabe!G$2+1,0)","v":0},{"$f":"VLOOKUP(Datenausgabe!H7,EZVorgaben,Datenausgabe!H$2+1,0)","v":0},{"$f":"VLOOKUP(Datenausgabe!I7,EZVorgaben,Datenausgabe!I$2+1,0)","v":0},{"$f":"VLOOKUP(Datenausgabe!J7,EZVorgaben,Datenausgabe!J$2+1,0)","v":0},{"$f":"VLOOKUP(Datenausgabe!K7,EZVorgaben,Datenausgabe!K$2+1,0)","v":0},{"$f":"VLOOKUP(Datenausgabe!L7,EZVorgaben,Datenausgabe!L$2+1,0)","v":0},{"$f":"VLOOKUP(Datenausgabe!M7,EZVorgaben,Datenausgabe!M$2+1,0)","v":0}]
["EZ TZ Klassifizierung",{"$f":"IF(Arbeitgeberkosten!$E$21<>\"\",VALUE(MID(Arbeitgeberkosten!$E$21,5,1)),1)","v":1}," 1 = Teilzeit & Tage ' 2 = ungekürzt' 3 = Tage-Kürzung' 4 = Teilzeit-Kürzung"]
["Abbweichender betrag",{"$f":"IF(Datenausgabe!B79,Datenausgabe!B80,0)*IF($B$112=1,Datenausgabe!B20/Datenausgabe!B21*Datenausgabe!B22/Datenausgabe!B26,1)*IF($B$112=2,1,1)*IF($B$112=3,Datenausgabe!B22/Datenausgabe!B26,1)*IF($B$112=4,Datenausgabe!B20/Datenausgabe!B21,1)","v":0},{"$f":"IF(Datenausgabe!C79,Datenausgabe!C80,0)*IF($B$112=1,Datenausgabe!C20/Datenausgabe!C21*Datenausgabe!C22/Datenausgabe!C26,1)*IF($B$112=2,1,1)*IF($B$112=3,Datenausgabe!C22/Datenausgabe!C26,1)*IF($B$112=4,Datenausgabe!C20/Datenausgabe!C21,1)","v":0},{"$f":"IF(Datenausgabe!D79,Datenausgabe!D80,0)*IF($B$112=1,Datenausgabe!D20/Datenausgabe!D21*Datenausgabe!D22/Datenausgabe!D26,1)*IF($B$112=2,1,1)*IF($B$112=3,Datenausgabe!D22/Datenausgabe!D26,1)*IF($B$112=4,Datenausgabe!D20/Datenausgabe!D21,1)","v":0},{"$f":"IF(Datenausgabe!E79,Datenausgabe!E80,0)*IF($B$112=1,Datenausgabe!E20/Datenausgabe!E21*Datenausgabe!E22/Datenausgabe!E26,1)*IF($B$112=2,1,1)*IF($B$112=3,Datenausgabe!E22/Datenausgabe!E26,1)*IF($B$112=4,Datenausgabe!E20/Datenausgabe!E21,1)","v":0},{"$f":"IF(Datenausgabe!F79,Datenausgabe!F80,0)*IF($B$112=1,Datenausgabe!F20/Datenausgabe!F21*Datenausgabe!F22/Datenausgabe!F26,1)*IF($B$112=2,1,1)*IF($B$112=3,Datenausgabe!F22/Datenausgabe!F26,1)*IF($B$112=4,Datenausgabe!F20/Datenausgabe!F21,1)","v":0},{"$f":"IF(Datenausgabe!G79,Datenausgabe!G80,0)*IF($B$112=1,Datenausgabe!G20/Datenausgabe!G21*Datenausgabe!G22/Datenausgabe!G26,1)*IF($B$112=2,1,1)*IF($B$112=3,Datenausgabe!G22/Datenausgabe!G26,1)*IF($B$112=4,Datenausgabe!G20/Datenausgabe!G21,1)","v":0},{"$f":"IF(Datenausgabe!H79,Datenausgabe!H80,0)*IF($B$112=1,Datenausgabe!H20/Datenausgabe!H21*Datenausgabe!H22/Datenausgabe!H26,1)*IF($B$112=2,1,1)*IF($B$112=3,Datenausgabe!H22/Datenausgabe!H26,1)*IF($B$112=4,Datenausgabe!H20/Datenausgabe!H21,1)","v":0},{"$f":"IF(Datenausgabe!I79,Datenausgabe!I80,0)*IF($B$112=1,Datenausgabe!I20/Datenausgabe!I21*Datenausgabe!I22/Datenausgabe!I26,1)*IF($B$112=2,1,1)*IF($B$112=3,Datenausgabe!I22/Datenausgabe!I26,1)*IF($B$112=4,Datenausgabe!I20/Datenausgabe!I21,1)","v":0},{"$f":"IF(Datenausgabe!J79,Datenausgabe!J80,0)*IF($B$112=1,Datenausgabe!J20/Datenausgabe!J21*Datenausgabe!J22/Datenausgabe!J26,1)*IF($B$112=2,1,1)*IF($B$112=3,Datenausgabe!J22/Datenausgabe!J26,1)*IF($B$112=4,Datenausgabe!J20/Datenausgabe!J21,1)","v":0},{"$f":"IF(Datenausgabe!K79,Datenausgabe!K80,0)*IF($B$112=1,Datenausgabe!K20/Datenausgabe!K21*Datenausgabe!K22/Datenausgabe!K26,1)*IF($B$112=2,1,1)*IF($B$112=3,Datenausgabe!K22/Datenausgabe!K26,1)*IF($B$112=4,Datenausgabe!K20/Datenausgabe!K21,1)","v":0},{"$f":"IF(Datenausgabe!L79,Datenausgabe!L80,0)*IF($B$112=1,Datenausgabe!L20/Datenausgabe!L21*Datenausgabe!L22/Datenausgabe!L26,1)*IF($B$112=2,1,1)*IF($B$112=3,Datenausgabe!L22/Datenausgabe!L26,1)*IF($B$112=4,Datenausgabe!L20/Datenausgabe!L21,1)","v":0},{"$f":"IF(Datenausgabe!M79,Datenausgabe!M80,0)*IF($B$112=1,Datenausgabe!M20/Datenausgabe!M21*Datenausgabe!M22/Datenausgabe!M26,1)*IF($B$112=2,1,1)*IF($B$112=3,Datenausgabe!M22/Datenausgabe!M26,1)*IF($B$112=4,Datenausgabe!M20/Datenausgabe!M21,1)","v":0}]
["Einmalzahlung TZ 1",{"$f":"B110*IF($B$112=1,Datenausgabe!B20/Datenausgabe!B21*Datenausgabe!B22/Datenausgabe!B26,1)*IF($B$112=2,1,1)*IF($B$112=3,Datenausgabe!B22/Datenausgabe!B26,1)*IF($B$112=4,Datenausgabe!B20/Datenausgabe!B21,1)","v":0},{"$f":"C110*IF($B$112=1,Datenausgabe!C20/Datenausgabe!C21*Datenausgabe!C22/Datenausgabe!C26,1)*IF($B$112=2,1,1)*IF($B$112=3,Datenausgabe!C22/Datenausgabe!C26,1)*IF($B$112=4,Datenausgabe!C20/Datenausgabe!C21,1)","v":0},{"$f":"D110*IF($B$112=1,Datenausgabe!D20/Datenausgabe!D21*Datenausgabe!D22/Datenausgabe!D26,1)*IF($B$112=2,1,1)*IF($B$112=3,Datenausgabe!D22/Datenausgabe!D26,1)*IF($B$112=4,Datenausgabe!D20/Datenausgabe!D21,1)","v":0},{"$f":"E110*IF($B$112=1,Datenausgabe!E20/Datenausgabe!E21*Datenausgabe!E22/Datenausgabe!E26,1)*IF($B$112=2,1,1)*IF($B$112=3,Datenausgabe!E22/Datenausgabe!E26,1)*IF($B$112=4,Datenausgabe!E20/Datenausgabe!E21,1)","v":0},{"$f":"F110*IF($B$112=1,Datenausgabe!F20/Datenausgabe!F21*Datenausgabe!F22/Datenausgabe!F26,1)*IF($B$112=2,1,1)*IF($B$112=3,Datenausgabe!F22/Datenausgabe!F26,1)*IF($B$112=4,Datenausgabe!F20/Datenausgabe!F21,1)","v":0},{"$f":"G110*IF($B$112=1,Datenausgabe!G20/Datenausgabe!G21*Datenausgabe!G22/Datenausgabe!G26,1)*IF($B$112=2,1,1)*IF($B$112=3,Datenausgabe!G22/Datenausgabe!G26,1)*IF($B$112=4,Datenausgabe!G20/Datenausgabe!G21,1)","v":0},{"$f":"H110*IF($B$112=1,Datenausgabe!H20/Datenausgabe!H21*Datenausgabe!H22/Datenausgabe!H26,1)*IF($B$112=2,1,1)*IF($B$112=3,Datenausgabe!H22/Datenausgabe!H26,1)*IF($B$112=4,Datenausgabe!H20/Datenausgabe!H21,1)","v":0},{"$f":"I110*IF($B$112=1,Datenausgabe!I20/Datenausgabe!I21*Datenausgabe!I22/Datenausgabe!I26,1)*IF($B$112=2,1,1)*IF($B$112=3,Datenausgabe!I22/Datenausgabe!I26,1)*IF($B$112=4,Datenausgabe!I20/Datenausgabe!I21,1)","v":0},{"$f":"J110*IF($B$112=1,Datenausgabe!J20/Datenausgabe!J21*Datenausgabe!J22/Datenausgabe!J26,1)*IF($B$112=2,1,1)*IF($B$112=3,Datenausgabe!J22/Datenausgabe!J26,1)*IF($B$112=4,Datenausgabe!J20/Datenausgabe!J21,1)","v":0},{"$f":"K110*IF($B$112=1,Datenausgabe!K20/Datenausgabe!K21*Datenausgabe!K22/Datenausgabe!K26,1)*IF($B$112=2,1,1)*IF($B$112=3,Datenausgabe!K22/Datenausgabe!K26,1)*IF($B$112=4,Datenausgabe!K20/Datenausgabe!K21,1)","v":0},{"$f":"L110*IF($B$112=1,Datenausgabe!L20/Datenausgabe!L21*Datenausgabe!L22/Datenausgabe!L26,1)*IF($B$112=2,1,1)*IF($B$112=3,Datenausgabe!L22/Datenausgabe!L26,1)*IF($B$112=4,Datenausgabe!L20/Datenausgabe!L21,1)","v":0},{"$f":"M110*IF($B$112=1,Datenausgabe!M20/Datenausgabe!M21*Datenausgabe!M22/Datenausgabe!M26,1)*IF($B$112=2,1,1)*IF($B$112=3,Datenausgabe!M22/Datenausgabe!M26,1)*IF($B$112=4,Datenausgabe!M20/Datenausgabe!M21,1)","v":0}]
["Einmalzahlung TZ 2",{"$f":"B111*IF($B$112=1,Datenausgabe!B23/Datenausgabe!B24*Datenausgabe!B25/Datenausgabe!B26,1)*IF($B$112=2,1,1)*IF($B$112=3,Datenausgabe!B25/Datenausgabe!B26,1)*IF($B$112=4,Datenausgabe!B23/Datenausgabe!B24,1)","v":0},{"$f":"C111*IF($B$112=1,Datenausgabe!C23/Datenausgabe!C24*Datenausgabe!C25/Datenausgabe!C26,1)*IF($B$112=2,1,1)*IF($B$112=3,Datenausgabe!C25/Datenausgabe!C26,1)*IF($B$112=4,Datenausgabe!C23/Datenausgabe!C24,1)","v":0},{"$f":"D111*IF($B$112=1,Datenausgabe!D23/Datenausgabe!D24*Datenausgabe!D25/Datenausgabe!D26,1)*IF($B$112=2,1,1)*IF($B$112=3,Datenausgabe!D25/Datenausgabe!D26,1)*IF($B$112=4,Datenausgabe!D23/Datenausgabe!D24,1)","v":0},{"$f":"E111*IF($B$112=1,Datenausgabe!E23/Datenausgabe!E24*Datenausgabe!E25/Datenausgabe!E26,1)*IF($B$112=2,1,1)*IF($B$112=3,Datenausgabe!E25/Datenausgabe!E26,1)*IF($B$112=4,Datenausgabe!E23/Datenausgabe!E24,1)","v":0},{"$f":"F111*IF($B$112=1,Datenausgabe!F23/Datenausgabe!F24*Datenausgabe!F25/Datenausgabe!F26,1)*IF($B$112=2,1,1)*IF($B$112=3,Datenausgabe!F25/Datenausgabe!F26,1)*IF($B$112=4,Datenausgabe!F23/Datenausgabe!F24,1)","v":0},{"$f":"G111*IF($B$112=1,Datenausgabe!G23/Datenausgabe!G24*Datenausgabe!G25/Datenausgabe!G26,1)*IF($B$112=2,1,1)*IF($B$112=3,Datenausgabe!G25/Datenausgabe!G26,1)*IF($B$112=4,Datenausgabe!G23/Datenausgabe!G24,1)","v":0},{"$f":"H111*IF($B$112=1,Datenausgabe!H23/Datenausgabe!H24*Datenausgabe!H25/Datenausgabe!H26,1)*IF($B$112=2,1,1)*IF($B$112=3,Datenausgabe!H25/Datenausgabe!H26,1)*IF($B$112=4,Datenausgabe!H23/Datenausgabe!H24,1)","v":0},{"$f":"I111*IF($B$112=1,Datenausgabe!I23/Datenausgabe!I24*Datenausgabe!I25/Datenausgabe!I26,1)*IF($B$112=2,1,1)*IF($B$112=3,Datenausgabe!I25/Datenausgabe!I26,1)*IF($B$112=4,Datenausgabe!I23/Datenausgabe!I24,1)","v":0},{"$f":"J111*IF($B$112=1,Datenausgabe!J23/Datenausgabe!J24*Datenausgabe!J25/Datenausgabe!J26,1)*IF($B$112=2,1,1)*IF($B$112=3,Datenausgabe!J25/Datenausgabe!J26,1)*IF($B$112=4,Datenausgabe!J23/Datenausgabe!J24,1)","v":0},{"$f":"K111*IF($B$112=1,Datenausgabe!K23/Datenausgabe!K24*Datenausgabe!K25/Datenausgabe!K26,1)*IF($B$112=2,1,1)*IF($B$112=3,Datenausgabe!K25/Datenausgabe!K26,1)*IF($B$112=4,Datenausgabe!K23/Datenausgabe!K24,1)","v":0},{"$f":"L111*IF($B$112=1,Datenausgabe!L23/Datenausgabe!L24*Datenausgabe!L25/Datenausgabe!L26,1)*IF($B$112=2,1,1)*IF($B$112=3,Datenausgabe!L25/Datenausgabe!L26,1)*IF($B$112=4,Datenausgabe!L23/Datenausgabe!L24,1)","v":0},{"$f":"M111*IF($B$112=1,Datenausgabe!M23/Datenausgabe!M24*Datenausgabe!M25/Datenausgabe!M26,1)*IF($B$112=2,1,1)*IF($B$112=3,Datenausgabe!M25/Datenausgabe!M26,1)*IF($B$112=4,Datenausgabe!M23/Datenausgabe!M24,1)","v":0}]
["Einmalzahlung Ergebnis",{"$f":"IF(Datenausgabe!B1,IF(Datenausgabe!B79,IF(B113<>0,B113,B114+IF(Datenausgabe!B14,B115,0)),0),0)","v":0},{"$f":"IF(Datenausgabe!C1,IF(Datenausgabe!C79,IF(C113<>0,C113,C114+IF(Datenausgabe!C14,C115,0)),0),0)","v":0},{"$f":"IF(Datenausgabe!D1,IF(Datenausgabe!D79,IF(D113<>0,D113,D114+IF(Datenausgabe!D14,D115,0)),0),0)","v":0},{"$f":"IF(Datenausgabe!E1,IF(Datenausgabe!E79,IF(E113<>0,E113,E114+IF(Datenausgabe!E14,E115,0)),0),0)","v":0},{"$f":"IF(Datenausgabe!F1,IF(Datenausgabe!F79,IF(F113<>0,F113,F114+IF(Datenausgabe!F14,F115,0)),0),0)","v":0},{"$f":"IF(Datenausgabe!G1,IF(Datenausgabe!G79,IF(G113<>0,G113,G114+IF(Datenausgabe!G14,G115,0)),0),0)","v":0},{"$f":"IF(Datenausgabe!H1,IF(Datenausgabe!H79,IF(H113<>0,H113,H114+IF(Datenausgabe!H14,H115,0)),0),0)","v":0},{"$f":"IF(Datenausgabe!I1,IF(Datenausgabe!I79,IF(I113<>0,I113,I114+IF(Datenausgabe!I14,I115,0)),0),0)","v":0},{"$f":"IF(Datenausgabe!J1,IF(Datenausgabe!J79,IF(J113<>0,J113,J114+IF(Datenausgabe!J14,J115,0)),0),0)","v":0},{"$f":"IF(Datenausgabe!K1,IF(Datenausgabe!K79,IF(K113<>0,K113,K114+IF(Datenausgabe!K14,K115,0)),0),0)","v":0},{"$f":"IF(Datenausgabe!L1,IF(Datenausgabe!L79,IF(L113<>0,L113,L114+IF(Datenausgabe!L14,L115,0)),0),0)","v":0},{"$f":"IF(Datenausgabe!M1,IF(Datenausgabe!M79,IF(M113<>0,M113,M114+IF(Datenausgabe!M14,M115,0)),0),0)","v":0}]
["Sonderzuwendung"]
["Monatsnummer",{"$f":"Datenausgabe!B2","v":1},{"$f":"Datenausgabe!C2","v":2},{"$f":"Datenausgabe!D2","v":3},{"$f":"Datenausgabe!E2","v":4},{"$f":"Datenausgabe!F2","v":5},{"$f":"Datenausgabe!G2","v":6},{"$f":"Datenausgabe!H2","v":7},{"$f":"Datenausgabe!I2","v":8},{"$f":"Datenausgabe!J2","v":9},{"$f":"Datenausgabe!K2","v":10},{"$f":"Datenausgabe!L2","v":11},{"$f":"Datenausgabe!M2","v":12}]
["Bemessungsgrundlage:",{"$f":"SUM(IF(MID(Arbeitgeberkosten!$E$7:$E$18,6,1)=\"J\",Arbeitgeberkosten!F7:F18,0))","v":0},{"$f":"SUM(IF(MID(Arbeitgeberkosten!$E$7:$E$18,6,1)=\"J\",Arbeitgeberkosten!G7:G18,0))","v":0},{"$f":"SUM(IF(MID(Arbeitgeberkosten!$E$7:$E$18,6,1)=\"J\",Arbeitgeberkosten!H7:H18,0))","v":0},{"$f":"SUM(IF(MID(Arbeitgeberkosten!$E$7:$E$18,6,1)=\"J\",Arbeitgeberkosten!I7:I18,0))","v":0},{"$f":"SUM(IF(MID(Arbeitgeberkosten!$E$7:$E$18,6,1)=\"J\",Arbeitgeberkosten!J7:J18,0))","v":0},{"$f":"SUM(IF(MID(Arbeitgeberkosten!$E$7:$E$18,6,1)=\"J\",Arbeitgeberkosten!K7:K18,0))","v":0},{"$f":"SUM(IF(MID(Arbeitgeberkosten!$E$7:$E$18,6,1)=\"J\",Arbeitgeberkosten!L7:L18,0))","v":0},{"$f":"SUM(IF(MID(Arbeitgeberkosten!$E$7:$E$18,6,1)=\"J\",Arbeitgeberkosten!M7:M18,0))","v":0},{"$f":"SUM(IF(MID(Arbeitgeberkosten!$E$7:$E$18,6,1)=\"J\",Arbeitgeberkosten!N7:N18,0))","v":0},{"$f":"SUM(IF(MID(Arbeitgeberkosten!$E$7:$E$18,6,1)=\"J\",Arbeitgeberkosten!O7:O18,0))","v":0},{"$f":"SUM(IF(MID(Arbeitgeberkosten!$E$7:$E$18,6,1)=\"J\",Arbeitgeberkosten!P7:P18,0))","v":0},{"$f":"SUM(IF(MID(Arbeitgeberkosten!$E$7:$E$18,6,1)=\"J\",Arbeitgeberkosten!Q7:Q18,0))","v":0}]
["Anz. Kinder",{"$f":"Datenausgabe!B36","v":0},{"$f":"Datenausgabe!C36","v":0},{"$f":"Datenausgabe!D36","v":0},{"$f":"Datenausgabe!E36","v":0},{"$f":"Datenausgabe!F36","v":0},{"$f":"Datenausgabe!G36","v":0},{"$f":"Datenausgabe!H36","v":0},{"$f":"Datenausgabe!I36","v":0},{"$f":"Datenausgabe!J36","v":0},{"$f":"Datenausgabe!K36","v":0},{"$f":"Datenausgabe!L36","v":0},{"$f":"Datenausgabe!M36","v":0}]
["TZ Faktor",{"$f":"Datenausgabe!B20/Datenausgabe!B21","v":1},{"$f":"Datenausgabe!C20/Datenausgabe!C21","v":1},{"$f":"Datenausgabe!D20/Datenausgabe!D21","v":1},{"$f":"Datenausgabe!E20/Datenausgabe!E21","v":1},{"$f":"Datenausgabe!F20/Datenausgabe!F21","v":1},{"$f":"Datenausgabe!G20/Datenausgabe!G21","v":1},{"$f":"Datenausgabe!H20/Datenausgabe!H21","v":1},{"$f":"Datenausgabe!I20/Datenausgabe!I21","v":1},{"$f":"Datenausgabe!J20/Datenausgabe!J21","v":1},{"$f":"Datenausgabe!K20/Datenausgabe!K21","v":1},{"$f":"Datenausgabe!L20/Datenausgabe!L21","v":1},{"$f":"Datenausgabe!M20/Datenausgabe!M21","v":1}]
["Bemessungsgrdl. Monat 1",{"$f":"IF(Datenausgabe!B$68,HLOOKUP(Datenausgabe!B72,$B$118:$M$119,2,0),0)","v":0},{"$f":"IF(Datenausgabe!C$68,HLOOKUP(Datenausgabe!C72,$B$118:$M$119,2,0),0)","v":0},{"$f":"IF(Datenausgabe!D$68,HLOOKUP(Datenausgabe!D72,$B$118:$M$119,2,0),0)","v":0},{"$f":"IF(Datenausgabe!E$68,HLOOKUP(Datenausgabe!E72,$B$118:$M$119,2,0),0)","v":0},{"$f":"IF(Datenausgabe!F$68,HLOOKUP(Datenausgabe!F72,$B$118:$M$119,2,0),0)","v":0},{"$f":"IF(Datenausgabe!G$68,HLOOKUP(Datenausgabe!G72,$B$118:$M$119,2,0),0)","v":0},{"$f":"IF(Datenausgabe!H$68,HLOOKUP(Datenausgabe!H72,$B$118:$M$119,2,0),0)","v":0},{"$f":"IF(Datenausgabe!I$68,HLOOKUP(Datenausgabe!I72,$B$118:$M$119,2,0),0)","v":0},{"$f":"IF(Datenausgabe!J$68,HLOOKUP(Datenausgabe!J72,$B$118:$M$119,2,0),0)","v":0},{"$f":"IF(Datenausgabe!K$68,HLOOKUP(Datenausgabe!K72,$B$118:$M$119,2,0),0)","v":0},{"$f":"IF(Datenausgabe!L$68,HLOOKUP(Datenausgabe!L72,$B$118:$M$119,2,0),0)","v":0},{"$f":"IF(Datenausgabe!M$68,HLOOKUP(Datenausgabe!M72,$B$118:$M$119,2,0),0)","v":0}]
["Bemessungsgrdl. Monat 2",{"$f":"IF(Datenausgabe!B$68,HLOOKUP(Datenausgabe!B73,$B$118:$M$119,2,0),0)","v":0},{"$f":"IF(Datenausgabe!C$68,HLOOKUP(Datenausgabe!C73,$B$118:$M$119,2,0),0)","v":0},{"$f":"IF(Datenausgabe!D$68,HLOOKUP(Datenausgabe!D73,$B$118:$M$119,2,0),0)","v":0},{"$f":"IF(Datenausgabe!E$68,HLOOKUP(Datenausgabe!E73,$B$118:$M$119,2,0),0)","v":0},{"$f":"IF(Datenausgabe!F$68,HLOOKUP(Datenausgabe!F73,$B$118:$M$119,2,0),0)","v":0},{"$f":"IF(Datenausgabe!G$68,HLOOKUP(Datenausgabe!G73,$B$118:$M$119,2,0),0)","v":0},{"$f":"IF(Datenausgabe!H$68,HLOOKUP(Datenausgabe!H73,$B$118:$M$119,2,0),0)","v":0},{"$f":"IF(Datenausgabe!I$68,HLOOKUP(Datenausgabe!I73,$B$118:$M$119,2,0),0)","v":0},{"$f":"IF(Datenausgabe!J$68,HLOOKUP(Datenausgabe!J73,$B$118:$M$119,2,0),0)","v":0},{"$f":"IF(Datenausgabe!K$68,HLOOKUP(Datenausgabe!K73,$B$118:$M$119,2,0),0)","v":0},{"$f":"IF(Datenausgabe!L$68,HLOOKUP(Datenausgabe!L73,$B$118:$M$119,2,0),0)","v":0},{"$f":"IF(Datenausgabe!M$68,HLOOKUP(Datenausgabe!M73,$B$118:$M$119,2,0),0)","v":0}]
["Bemessungsgrdl. Monat 3",{"$f":"IF(Datenausgabe!B$68,HLOOKUP(Datenausgabe!B74,$B$118:$M$119,2,0),0)","v":0},{"$f":"IF(Datenausgabe!C$68,HLOOKUP(Datenausgabe!C74,$B$118:$M$119,2,0),0)","v":0},{"$f":"IF(Datenausgabe!D$68,HLOOKUP(Datenausgabe!D74,$B$118:$M$119,2,0),0)","v":0},{"$f":"IF(Datenausgabe!E$68,HLOOKUP(Datenausgabe!E74,$B$118:$M$119,2,0),0)","v":0},{"$f":"IF(Datenausgabe!F$68,HLOOKUP(Datenausgabe!F74,$B$118:$M$119,2,0),0)","v":0},{"$f":"IF(Datenausgabe!G$68,HLOOKUP(Datenausgabe!G74,$B$118:$M$119,2,0),0)","v":0},{"$f":"IF(Datenausgabe!H$68,HLOOKUP(Datenausgabe!H74,$B$118:$M$119,2,0),0)","v":0},{"$f":"IF(Datenausgabe!I$68,HLOOKUP(Datenausgabe!I74,$B$118:$M$119,2,0),0)","v":0},{"$f":"IF(Datenausgabe!J$68,HLOOKUP(Datenausgabe!J74,$B$118:$M$119,2,0),0)","v":0},{"$f":"IF(Datenausgabe!K$68,HLOOKUP(Datenausgabe!K74,$B$118:$M$119,2,0),0)","v":0},{"$f":"IF(Datenausgabe!L$68,HLOOKUP(Datenausgabe!L74,$B$118:$M$119,2,0),0)","v":0},{"$f":"IF(Datenausgabe!M$68,HLOOKUP(Datenausgabe!M74,$B$118:$M$119,2,0),0)","v":0}]
["Mittelwert:",{"$f":"AVERAGE(B122:B124)","v":0},{"$f":"AVERAGE(C122:C124)","v":0},0,0,0,0,0,0,0,0,0,0]
["Zuwendung %",{"$f":"IF(Datenausgabe!B78,Datenausgabe!B69/100,VLOOKUP(Datenausgabe!B$6,[2]!Verguetung,26,0))","v":0.68810000000000004},{"$f":"IF(Datenausgabe!C78,Datenausgabe!C69/100,VLOOKUP(Datenausgabe!C$6,[2]!Verguetung,26,0))","v":0.68810000000000004},{"$f":"IF(Datenausgabe!D78,Datenausgabe!D69/100,VLOOKUP(Datenausgabe!D$6,[3]!Verguetung,26,0))","v":0.68089999999999995},{"$f":"IF(Datenausgabe!E78,Datenausgabe!E69/100,VLOOKUP(Datenausgabe!E$6,[3]!Verguetung,26,0))","v":0.68089999999999995},{"$f":"IF(Datenausgabe!F78,Datenausgabe!F69/100,VLOOKUP(Datenausgabe!F$6,[3]!Verguetung,26,0))","v":0.68089999999999995},{"$f":"IF(Datenausgabe!G78,Datenausgabe!G69/100,VLOOKUP(Datenausgabe!G$6,[3]!Verguetung,26,0))","v":0.68089999999999995},{"$f":"IF(Datenausgabe!H78,Datenausgabe!H69/100,VLOOKUP(Datenausgabe!H$6,[3]!Verguetung,26,0))","v":0.68089999999999995},{"$f":"IF(Datenausgabe!I78,Datenausgabe!I69/100,VLOOKUP(Datenausgabe!I$6,[3]!Verguetung,26,0))","v":0.68089999999999995},{"$f":"IF(Datenausgabe!J78,Datenausgabe!J69/100,VLOOKUP(Datenausgabe!J$6,[3]!Verguetung,26,0))","v":0.68089999999999995},{"$f":"IF(Datenausgabe!K78,Datenausgabe!K69/100,VLOOKUP(Datenausgabe!K$6,[3]!Verguetung,26,0))","v":0.68089999999999995},{"$f":"IF(Datenausgabe!L78,Datenausgabe!L69/100,VLOOKUP(Datenausgabe!L$6,[3]!Verguetung,26,0))","v":0.68089999999999995},{"$f":"IF(Datenausgabe!M78,Datenausgabe!M69/100,VLOOKUP(Datenausgabe!M$6,[3]!Verguetung,26,0))","v":0.68089999999999995}]
["Zuwendung",{"$f":"IF(Datenausgabe!B75,B125,B122)*B126","v":0},{"$f":"IF(Datenausgabe!C75,C125,C122)*C126","v":0},{"$f":"IF(Datenausgabe!D75,D125,D122)*D126","v":0},{"$f":"IF(Datenausgabe!E75,E125,E122)*E126","v":0},{"$f":"IF(Datenausgabe!F75,F125,F122)*F126","v":0},{"$f":"IF(Datenausgabe!G75,G125,G122)*G126","v":0},{"$f":"IF(Datenausgabe!H75,H125,H122)*H126","v":0},{"$f":"IF(Datenausgabe!I75,I125,I122)*I126","v":0},{"$f":"IF(Datenausgabe!J75,J125,J122)*J126","v":0},{"$f":"IF(Datenausgabe!K75,K125,K122)*K126","v":0},{"$f":"IF(Datenausgabe!L75,L125,L122)*L126","v":0},{"$f":"IF(Datenausgabe!M75,M125,M122)*M126","v":0}]
["Kinderbetrag kürzen?",{"$f":"IF(LEFT(Datenausgabe!B4,5)=\"BBesG\",FALSE,TRUE)","v":true},{"$f":"IF(LEFT(Datenausgabe!C4,5)=\"BBesG\",FALSE,TRUE)","v":true},{"$f":"IF(LEFT(Datenausgabe!D4,5)=\"BBesG\",FALSE,TRUE)","v":true},{"$f":"IF(LEFT(Datenausgabe!E4,5)=\"BBesG\",FALSE,TRUE)","v":true},{"$f":"IF(LEFT(Datenausgabe!F4,5)=\"BBesG\",FALSE,TRUE)","v":true},{"$f":"IF(LEFT(Datenausgabe!G4,5)=\"BBesG\",FALSE,TRUE)","v":true},{"$f":"IF(LEFT(Datenausgabe!H4,5)=\"BBesG\",FALSE,TRUE)","v":true},{"$f":"IF(LEFT(Datenausgabe!I4,5)=\"BBesG\",FALSE,TRUE)","v":true},{"$f":"IF(LEFT(Datenausgabe!J4,5)=\"BBesG\",FALSE,TRUE)","v":true},{"$f":"IF(LEFT(Datenausgabe!K4,5)=\"BBesG\",FALSE,TRUE)","v":true},{"$f":"IF(LEFT(Datenausgabe!L4,5)=\"BBesG\",FALSE,TRUE)","v":true},{"$f":"IF(LEFT(Datenausgabe!M4,5)=\"BBesG\",FALSE,TRUE)","v":true}]
["Kinderbetrag",{"$f":"HLOOKUP(Datenausgabe!B72,$B$118:$M$121,3,0)*Datenausgabe!B71*IF(B128,HLOOKUP(Datenausgabe!B72,$B$118:$M$121,4,0),1)","v":0},{"$f":"HLOOKUP(Datenausgabe!C72,$B$118:$M$121,3,0)*Datenausgabe!C71*IF(C128,HLOOKUP(Datenausgabe!C72,$B$118:$M$121,4,0),1)","v":0},{"$f":"HLOOKUP(Datenausgabe!D72,$B$118:$M$121,3,0)*Datenausgabe!D71*IF(D128,HLOOKUP(Datenausgabe!D72,$B$118:$M$121,4,0),1)","v":0},{"$f":"HLOOKUP(Datenausgabe!E72,$B$118:$M$121,3,0)*Datenausgabe!E71*IF(E128,HLOOKUP(Datenausgabe!E72,$B$118:$M$121,4,0),1)","v":0},{"$f":"HLOOKUP(Datenausgabe!F72,$B$118:$M$121,3,0)*Datenausgabe!F71*IF(F128,HLOOKUP(Datenausgabe!F72,$B$118:$M$121,4,0),1)","v":0},{"$f":"HLOOKUP(Datenausgabe!G72,$B$118:$M$121,3,0)*Datenausgabe!G71*IF(G128,HLOOKUP(Datenausgabe!G72,$B$118:$M$121,4,0),1)","v":0},{"$f":"HLOOKUP(Datenausgabe!H72,$B$118:$M$121,3,0)*Datenausgabe!H71*IF(H128,HLOOKUP(Datenausgabe!H72,$B$118:$M$121,4,0),1)","v":0},{"$f":"HLOOKUP(Datenausgabe!I72,$B$118:$M$121,3,0)*Datenausgabe!I71*IF(I128,HLOOKUP(Datenausgabe!I72,$B$118:$M$121,4,0),1)","v":0},{"$f":"HLOOKUP(Datenausgabe!J72,$B$118:$M$121,3,0)*Datenausgabe!J71*IF(J128,HLOOKUP(Datenausgabe!J72,$B$118:$M$121,4,0),1)","v":0},{"$f":"HLOOKUP(Datenausgabe!K72,$B$118:$M$121,3,0)*Datenausgabe!K71*IF(K128,HLOOKUP(Datenausgabe!K72,$B$118:$M$121,4,0),1)","v":0},{"$f":"HLOOKUP(Datenausgabe!L72,$B$118:$M$121,3,0)*Datenausgabe!L71*IF(L128,HLOOKUP(Datenausgabe!L72,$B$118:$M$121,4,0),1)","v":0},{"$f":"HLOOKUP(Datenausgabe!M72,$B$118:$M$121,3,0)*Datenausgabe!M71*IF(M128,HLOOKUP(Datenausgabe!M72,$B$118:$M$121,4,0),1)","v":0}]
["Weihnachtsgeld Ergebnis",{"$f":"IF(Datenausgabe!B68,B127+B129,0)","v":0},{"$f":"IF(Datenausgabe!C68,C127+C129,0)","v":0},{"$f":"IF(Datenausgabe!D68,D127+D129,0)","v":0},{"$f":"IF(Datenausgabe!E68,E127+E129,0)","v":0},{"$f":"IF(Datenausgabe!F68,F127+F129,0)","v":0},{"$f":"IF(Datenausgabe!G68,G127+G129,0)","v":0},{"$f":"IF(Datenausgabe!H68,H127+H129,0)","v":0},{"$f":"IF(Datenausgabe!I68,I127+I129,0)","v":0},{"$f":"IF(Datenausgabe!J68,J127+J129,0)","v":0},{"$f":"IF(Datenausgabe!K68,K127+K129,0)","v":0},{"$f":"IF(Datenausgabe!L68,L127+L129,0)","v":0},{"$f":"IF(Datenausgabe!M68,M127+M129,0)","v":0}]
["Leistungsentgelt"]
["Monatsnummer",{"$f":"Datenausgabe!B2-1","v":0},{"$f":"Datenausgabe!C2-1","v":1},{"$f":"Datenausgabe!D2-1","v":2},{"$f":"Datenausgabe!E2-1","v":3},{"$f":"Datenausgabe!F2-1","v":4},{"$f":"Datenausgabe!G2-1","v":5},{"$f":"Datenausgabe!H2-1","v":6},{"$f":"Datenausgabe!I2-1","v":7},{"$f":"Datenausgabe!J2-1","v":8},{"$f":"Datenausgabe!K2-1","v":9},{"$f":"Datenausgabe!L2-1","v":10},{"$f":"Datenausgabe!M2-1","v":11}]
["Bemessungsgrundlage:",{"$f":"Arbeitgeberkosten!F7+Arbeitgeberkosten!F8","v":0},{"$f":"Arbeitgeberkosten!G7+Arbeitgeberkosten!G8","v":0},{"$f":"Arbeitgeberkosten!H7+Arbeitgeberkosten!H8","v":0},{"$f":"Arbeitgeberkosten!I7+Arbeitgeberkosten!I8","v":0},{"$f":"Arbeitgeberkosten!J7+Arbeitgeberkosten!J8","v":0},{"$f":"Arbeitgeberkosten!K7+Arbeitgeberkosten!K8","v":0},{"$f":"Arbeitgeberkosten!L7+Arbeitgeberkosten!L8","v":0},{"$f":"Arbeitgeberkosten!M7+Arbeitgeberkosten!M8","v":0},{"$f":"Arbeitgeberkosten!N7+Arbeitgeberkosten!N8","v":0},{"$f":"Arbeitgeberkosten!O7+Arbeitgeberkosten!O8","v":0},{"$f":"Arbeitgeberkosten!P7+Arbeitgeberkosten!P8","v":0},{"$f":"Arbeitgeberkosten!Q7+Arbeitgeberkosten!Q8","v":0}]
["Leistungsentgelt",{"$f":"IF(Datenausgabe!B91,Datenausgabe!B93,IF(Datenausgabe!B90,0,HLOOKUP(Datenausgabe!B95,$B$132:$M$133,2,0)*Datenausgabe!B94/100))","v":0},{"$f":"IF(Datenausgabe!C91,Datenausgabe!C93,IF(Datenausgabe!C90,0,HLOOKUP(Datenausgabe!C95,$B$132:$M$133,2,0)*Datenausgabe!C94/100))","v":0},{"$f":"IF(Datenausgabe!D91,Datenausgabe!D93,IF(Datenausgabe!D90,0,HLOOKUP(Datenausgabe!D95,$B$132:$M$133,2,0)*Datenausgabe!D94/100))","v":0},{"$f":"IF(Datenausgabe!E91,Datenausgabe!E93,IF(Datenausgabe!E90,0,HLOOKUP(Datenausgabe!E95,$B$132:$M$133,2,0)*Datenausgabe!E94/100))","v":0},{"$f":"IF(Datenausgabe!F91,Datenausgabe!F93,IF(Datenausgabe!F90,0,HLOOKUP(Datenausgabe!F95,$B$132:$M$133,2,0)*Datenausgabe!F94/100))","v":0},{"$f":"IF(Datenausgabe!G91,Datenausgabe!G93,IF(Datenausgabe!G90,0,HLOOKUP(Datenausgabe!G95,$B$132:$M$133,2,0)*Datenausgabe!G94/100))","v":0},{"$f":"IF(Datenausgabe!H91,Datenausgabe!H93,IF(Datenausgabe!H90,0,HLOOKUP(Datenausgabe!H95,$B$132:$M$133,2,0)*Datenausgabe!H94/100))","v":0},{"$f":"IF(Datenausgabe!I91,Datenausgabe!I93,IF(Datenausgabe!I90,0,HLOOKUP(Datenausgabe!I95,$B$132:$M$133,2,0)*Datenausgabe!I94/100))","v":0},{"$f":"IF(Datenausgabe!J91,Datenausgabe!J93,IF(Datenausgabe!J90,0,HLOOKUP(Datenausgabe!J95,$B$132:$M$133,2,0)*Datenausgabe!J94/100))","v":0},{"$f":"IF(Datenausgabe!K91,Datenausgabe!K93,IF(Datenausgabe!K90,0,HLOOKUP(Datenausgabe!K95,$B$132:$M$133,2,0)*Datenausgabe!K94/100))","v":0},{"$f":"IF(Datenausgabe!L91,Datenausgabe!L93,IF(Datenausgabe!L90,0,HLOOKUP(Datenausgabe!L95,$B$132:$M$133,2,0)*Datenausgabe!L94/100))","v":0},{"$f":"IF(Datenausgabe!M91,Datenausgabe!M93,IF(Datenausgabe!M90,0,HLOOKUP(Datenausgabe!M95,$B$132:$M$133,2,0)*Datenausgabe!M94/100))","v":0}]
["Pauschalsteuern"]
["Für ZVK zu versteuern:",{"$f":"Arbeitgeberkosten!F47+B279","v":0},{"$f":"Arbeitgeberkosten!G47+C279","v":0},{"$f":"Arbeitgeberkosten!H47+D279","v":0},{"$f":"Arbeitgeberkosten!I47+E279","v":0},{"$f":"Arbeitgeberkosten!J47+F279","v":0},{"$f":"Arbeitgeberkosten!K47+G279","v":0},{"$f":"Arbeitgeberkosten!L47+H279","v":0},{"$f":"Arbeitgeberkosten!M47+I279","v":0},{"$f":"Arbeitgeberkosten!N47+J279","v":0},{"$f":"Arbeitgeberkosten!O47+K279","v":0},{"$f":"Arbeitgeberkosten!P47+L279","v":0},{"$f":"Arbeitgeberkosten!Q47+M279","v":0}]
["Pausch. LSt",{"$f":"ROUNDDOWN(B136*Datenausgabe!B112/100,2)","v":0},{"$f":"ROUNDDOWN(C136*Datenausgabe!C112/100,2)","v":0},{"$f":"ROUNDDOWN(D136*Datenausgabe!D112/100,2)","v":0},{"$f":"ROUNDDOWN(E136*Datenausgabe!E112/100,2)","v":0},{"$f":"ROUNDDOWN(F136*Datenausgabe!F112/100,2)","v":0},{"$f":"ROUNDDOWN(G136*Datenausgabe!G112/100,2)","v":0},{"$f":"ROUNDDOWN(H136*Datenausgabe!H112/100,2)","v":0},{"$f":"ROUNDDOWN(I136*Datenausgabe!I112/100,2)","v":0},{"$f":"ROUNDDOWN(J136*Datenausgabe!J112/100,2)","v":0},{"$f":"ROUNDDOWN(K136*Datenausgabe!K112/100,2)","v":0},{"$f":"ROUNDDOWN(L136*Datenausgabe!L112/100,2)","v":0},{"$f":"ROUNDDOWN(M136*Datenausgabe!M112/100,2)","v":0}]
["Pausch Soli",{"$f":"ROUNDDOWN(B137*Datenausgabe!B113/100,2)","v":0},{"$f":"ROUNDDOWN(C137*Datenausgabe!C113/100,2)","v":0},{"$f":"ROUNDDOWN(D137*Datenausgabe!D113/100,2)","v":0},{"$f":"ROUNDDOWN(E137*Datenausgabe!E113/100,2)","v":0},{"$f":"ROUNDDOWN(F137*Datenausgabe!F113/100,2)","v":0},{"$f":"ROUNDDOWN(G137*Datenausgabe!G113/100,2)","v":0},{"$f":"ROUNDDOWN(H137*Datenausgabe!H113/100,2)","v":0},{"$f":"ROUNDDOWN(I137*Datenausgabe!I113/100,2)","v":0},{"$f":"ROUNDDOWN(J137*Datenausgabe!J113/100,2)","v":0},{"$f":"ROUNDDOWN(K137*Datenausgabe!K113/100,2)","v":0},{"$f":"ROUNDDOWN(L137*Datenausgabe!L113/100,2)","v":0},{"$f":"ROUNDDOWN(M137*Datenausgabe!M113/100,2)","v":0}]
["Pausch KiSt",{"$f":"ROUNDDOWN(B137*Datenausgabe!B114/100,2)","v":0},{"$f":"ROUNDDOWN(C137*Datenausgabe!C114/100,2)","v":0},{"$f":"ROUNDDOWN(D137*Datenausgabe!D114/100,2)","v":0},{"$f":"ROUNDDOWN(E137*Datenausgabe!E114/100,2)","v":0},{"$f":"ROUNDDOWN(F137*Datenausgabe!F114/100,2)","v":0},{"$f":"ROUNDDOWN(G137*Datenausgabe!G114/100,2)","v":0},{"$f":"ROUNDDOWN(H137*Datenausgabe!H114/100,2)","v":0},{"$f":"ROUNDDOWN(I137*Datenausgabe!I114/100,2)","v":0},{"$f":"ROUNDDOWN(J137*Datenausgabe!J114/100,2)","v":0},{"$f":"ROUNDDOWN(K137*Datenausgabe!K114/100,2)","v":0},{"$f":"ROUNDDOWN(L137*Datenausgabe!L114/100,2)","v":0},{"$f":"ROUNDDOWN(M137*Datenausgabe!M114/100,2)","v":0}]
["Pauschalsteuer ZVK gesamt",{"$f":"SUM(B137:B139)","v":0},{"$f":"SUM(C137:C139)","v":0},0,0,0,0,0,0,0,0,0,0]
["Für Zulagen Pauschal zu verst.",{"$f":"SUM(IF(MID(Arbeitgeberkosten!$E$7:$E$22,2,1)=\"P\",Arbeitgeberkosten!F7:F22,0))","v":0},{"$f":"SUM(IF(MID(Arbeitgeberkosten!$E$7:$E$22,2,1)=\"P\",Arbeitgeberkosten!G7:G22,0))","v":0},{"$f":"SUM(IF(MID(Arbeitgeberkosten!$E$7:$E$22,2,1)=\"P\",Arbeitgeberkosten!H7:H22,0))","v":0},{"$f":"SUM(IF(MID(Arbeitgeberkosten!$E$7:$E$22,2,1)=\"P\",Arbeitgeberkosten!I7:I22,0))","v":0},{"$f":"SUM(IF(MID(Arbeitgeberkosten!$E$7:$E$22,2,1)=\"P\",Arbeitgeberkosten!J7:J22,0))","v":0},{"$f":"SUM(IF(MID(Arbeitgeberkosten!$E$7:$E$22,2,1)=\"P\",Arbeitgeberkosten!K7:K22,0))","v":0},{"$f":"SUM(IF(MID(Arbeitgeberkosten!$E$7:$E$22,2,1)=\"P\",Arbeitgeberkosten!L7:L22,0))","v":0},{"$f":"SUM(IF(MID(Arbeitgeberkosten!$E$7:$E$22,2,1)=\"P\",Arbeitgeberkosten!M7:M22,0))","v":0},{"$f":"SUM(IF(MID(Arbeitgeberkosten!$E$7:$E$22,2,1)=\"P\",Arbeitgeberkosten!N7:N22,0))","v":0},{"$f":"SUM(IF(MID(Arbeitgeberkosten!$E$7:$E$22,2,1)=\"P\",Arbeitgeberkosten!O7:O22,0))","v":0},{"$f":"SUM(IF(MID(Arbeitgeberkosten!$E$7:$E$22,2,1)=\"P\",Arbeitgeberkosten!P7:P22,0))","v":0},{"$f":"SUM(IF(MID(Arbeitgeberkosten!$E$7:$E$22,2,1)=\"P\",Arbeitgeberkosten!Q7:Q22,0))","v":0}]
["Pausch. LSt",{"$f":"ROUNDDOWN(B141*Datenausgabe!B115/100,2)","v":0},{"$f":"ROUNDDOWN(C141*Datenausgabe!C115/100,2)","v":0},{"$f":"ROUNDDOWN(D141*Datenausgabe!D115/100,2)","v":0},{"$f":"ROUNDDOWN(E141*Datenausgabe!E115/100,2)","v":0},{"$f":"ROUNDDOWN(F141*Datenausgabe!F115/100,2)","v":0},{"$f":"ROUNDDOWN(G141*Datenausgabe!G115/100,2)","v":0},{"$f":"ROUNDDOWN(H141*Datenausgabe!H115/100,2)","v":0},{"$f":"ROUNDDOWN(I141*Datenausgabe!I115/100,2)","v":0},{"$f":"ROUNDDOWN(J141*Datenausgabe!J115/100,2)","v":0},{"$f":"ROUNDDOWN(K141*Datenausgabe!K115/100,2)","v":0},{"$f":"ROUNDDOWN(L141*Datenausgabe!L115/100,2)","v":0},{"$f":"ROUNDDOWN(M141*Datenausgabe!M115/100,2)","v":0}]
["Pausch Soli",{"$f":"ROUNDDOWN(B142*Datenausgabe!B116/100,2)","v":0},{"$f":"ROUNDDOWN(C142*Datenausgabe!C116/100,2)","v":0},{"$f":"ROUNDDOWN(D142*Datenausgabe!D116/100,2)","v":0},{"$f":"ROUNDDOWN(E142*Datenausgabe!E116/100,2)","v":0},{"$f":"ROUNDDOWN(F142*Datenausgabe!F116/100,2)","v":0},{"$f":"ROUNDDOWN(G142*Datenausgabe!G116/100,2)","v":0},{"$f":"ROUNDDOWN(H142*Datenausgabe!H116/100,2)","v":0},{"$f":"ROUNDDOWN(I142*Datenausgabe!I116/100,2)","v":0},{"$f":"ROUNDDOWN(J142*Datenausgabe!J116/100,2)","v":0},{"$f":"ROUNDDOWN(K142*Datenausgabe!K116/100,2)","v":0},{"$f":"ROUNDDOWN(L142*Datenausgabe!L116/100,2)","v":0},{"$f":"ROUNDDOWN(M142*Datenausgabe!M116/100,2)","v":0}]
["Pausch KiSt",{"$f":"ROUNDDOWN(B142*Datenausgabe!B117/100,2)","v":0},{"$f":"ROUNDDOWN(C142*Datenausgabe!C117/100,2)","v":0},{"$f":"ROUNDDOWN(D142*Datenausgabe!D117/100,2)","v":0},{"$f":"ROUNDDOWN(E142*Datenausgabe!E117/100,2)","v":0},{"$f":"ROUNDDOWN(F142*Datenausgabe!F117/100,2)","v":0},{"$f":"ROUNDDOWN(G142*Datenausgabe!G117/100,2)","v":0},{"$f":"ROUNDDOWN(H142*Datenausgabe!H117/100,2)","v":0},{"$f":"ROUNDDOWN(I142*Datenausgabe!I117/100,2)","v":0},{"$f":"ROUNDDOWN(J142*Datenausgabe!J117/100,2)","v":0},{"$f":"ROUNDDOWN(K142*Datenausgabe!K117/100,2)","v":0},{"$f":"ROUNDDOWN(L142*Datenausgabe!L117/100,2)","v":0},{"$f":"ROUNDDOWN(M142*Datenausgabe!M117/100,2)","v":0}]
["Pauschalsteuer Zulagen gesamt",{"$f":"SUM(B142:B144)","v":0},{"$f":"SUM(C142:C144)","v":0},0,0,0,0,0,0,0,0,0,0]
["Pauschalsteuer AG gesamt:",{"$f":"IF(Datenausgabe!B157=\"VBL\",B140,0)+IF(Datenausgabe!B118,B145,0)","v":0},{"$f":"IF(Datenausgabe!C157=\"VBL\",C140,0)+IF(Datenausgabe!C118,C145,0)","v":0},{"$f":"IF(Datenausgabe!D157=\"VBL\",D140,0)+IF(Datenausgabe!D118,D145,0)","v":0},{"$f":"IF(Datenausgabe!E157=\"VBL\",E140,0)+IF(Datenausgabe!E118,E145,0)","v":0},{"$f":"IF(Datenausgabe!F157=\"VBL\",F140,0)+IF(Datenausgabe!F118,F145,0)","v":0},{"$f":"IF(Datenausgabe!G157=\"VBL\",G140,0)+IF(Datenausgabe!G118,G145,0)","v":0},{"$f":"IF(Datenausgabe!H157=\"VBL\",H140,0)+IF(Datenausgabe!H118,H145,0)","v":0},{"$f":"IF(Datenausgabe!I157=\"VBL\",I140,0)+IF(Datenausgabe!I118,I145,0)","v":0},{"$f":"IF(Datenausgabe!J157=\"VBL\",J140,0)+IF(Datenausgabe!J118,J145,0)","v":0},{"$f":"IF(Datenausgabe!K157=\"VBL\",K140,0)+IF(Datenausgabe!K118,K145,0)","v":0},{"$f":"IF(Datenausgabe!L157=\"VBL\",L140,0)+IF(Datenausgabe!L118,L145,0)","v":0},{"$f":"IF(Datenausgabe!M157=\"VBL\",M140,0)+IF(Datenausgabe!M118,M145,0)","v":0}]
["Pauschalsteuer AN gesamt:",{"$f":"IF(Datenausgabe!B118,0,B145)+IF(Datenausgabe!B157=\"KZVK\",B140,0)","v":0},{"$f":"IF(Datenausgabe!C118,0,C145)+IF(Datenausgabe!C157=\"KZVK\",C140,0)","v":0},{"$f":"IF(Datenausgabe!D118,0,D145)+IF(Datenausgabe!D157=\"KZVK\",D140,0)","v":0},{"$f":"IF(Datenausgabe!E118,0,E145)+IF(Datenausgabe!E157=\"KZVK\",E140,0)","v":0},{"$f":"IF(Datenausgabe!F118,0,F145)+IF(Datenausgabe!F157=\"KZVK\",F140,0)","v":0},{"$f":"IF(Datenausgabe!G118,0,G145)+IF(Datenausgabe!G157=\"KZVK\",G140,0)","v":0},{"$f":"IF(Datenausgabe!H118,0,H145)+IF(Datenausgabe!H157=\"KZVK\",H140,0)","v":0},{"$f":"IF(Datenausgabe!I118,0,I145)+IF(Datenausgabe!I157=\"KZVK\",I140,0)","v":0},{"$f":"IF(Datenausgabe!J118,0,J145)+IF(Datenausgabe!J157=\"KZVK\",J140,0)","v":0},{"$f":"IF(Datenausgabe!K118,0,K145)+IF(Datenausgabe!K157=\"KZVK\",K140,0)","v":0},{"$f":"IF(Datenausgabe!L118,0,L145)+IF(Datenausgabe!L157=\"KZVK\",L140,0)","v":0},{"$f":"IF(Datenausgabe!M118,0,M145)+IF(Datenausgabe!M157=\"KZVK\",M140,0)","v":0}]
["SV Brutto"]
["SVBrutto:",{"$f":"Arbeitgeberkosten!F28","v":6.65},{"$f":"Arbeitgeberkosten!G28","v":6.65},{"$f":"Arbeitgeberkosten!H28","v":6.65},{"$f":"Arbeitgeberkosten!I28","v":6.65},{"$f":"Arbeitgeberkosten!J28","v":6.65},{"$f":"Arbeitgeberkosten!K28","v":6.65},{"$f":"Arbeitgeberkosten!L28","v":6.65},{"$f":"Arbeitgeberkosten!M28","v":6.65},{"$f":"Arbeitgeberkosten!N28","v":6.65},{"$f":"Arbeitgeberkosten!O28","v":6.65},{"$f":"Arbeitgeberkosten!P28","v":6.65},{"$f":"Arbeitgeberkosten!Q28","v":6.65}]
["Hinzur Verteilen?",{"$f":"IF(Arbeitgeberkosten!F22>0,TRUE,FALSE)","v":false},{"$f":"IF(Arbeitgeberkosten!G22>0,TRUE,FALSE)","v":false},{"$f":"IF(Arbeitgeberkosten!H22>0,TRUE,FALSE)","v":false},{"$f":"IF(Arbeitgeberkosten!I22>0,TRUE,FALSE)","v":false},{"$f":"IF(Arbeitgeberkosten!J22>0,TRUE,FALSE)","v":false},{"$f":"IF(Arbeitgeberkosten!K22>0,TRUE,FALSE)","v":false},{"$f":"IF(Arbeitgeberkosten!L22>0,TRUE,FALSE)","v":false},{"$f":"IF(Arbeitgeberkosten!M22>0,TRUE,FALSE)","v":false},{"$f":"IF(Arbeitgeberkosten!N22>0,TRUE,FALSE)","v":false},{"$f":"IF(Arbeitgeberkosten!O22>0,TRUE,FALSE)","v":false},{"$f":"IF(Arbeitgeberkosten!P22>0,TRUE,FALSE)","v":false},{"$f":"IF(Arbeitgeberkosten!Q22>0,TRUE,FALSE)","v":false}]
["Einmalzahlungen",{"$f":"SUM(IF(MID(Arbeitgeberkosten!$E$7:$E$22,3,1)=\"E\",Arbeitgeberkosten!F7:F22,0))","v":0},{"$f":"SUM(IF(MID(Arbeitgeberkosten!$E$7:$E$22,3,1)=\"E\",Arbeitgeberkosten!G7:G22,0))","v":0},{"$f":"SUM(IF(MID(Arbeitgeberkosten!$E$7:$E$22,3,1)=\"E\",Arbeitgeberkosten!H7:H22,0))","v":0},{"$f":"SUM(IF(MID(Arbeitgeberkosten!$E$7:$E$22,3,1)=\"E\",Arbeitgeberkosten!I7:I22,0))","v":0},{"$f":"SUM(IF(MID(Arbeitgeberkosten!$E$7:$E$22,3,1)=\"E\",Arbeitgeberkosten!J7:J22,0))","v":0},{"$f":"SUM(IF(MID(Arbeitgeberkosten!$E$7:$E$22,3,1)=\"E\",Arbeitgeberkosten!K7:K22,0))","v":0},{"$f":"SUM(IF(MID(Arbeitgeberkosten!$E$7:$E$22,3,1)=\"E\",Arbeitgeberkosten!L7:L22,0))","v":0},{"$f":"SUM(IF(MID(Arbeitgeberkosten!$E$7:$E$22,3,1)=\"E\",Arbeitgeberkosten!M7:M22,0))","v":0},{"$f":"SUM(IF(MID(Arbeitgeberkosten!$E$7:$E$22,3,1)=\"E\",Arbeitgeberkosten!N7:N22,0))","v":0},{"$f":"SUM(IF(MID(Arbeitgeberkosten!$E$7:$E$22,3,1)=\"E\",Arbeitgeberkosten!O7:O22,0))","v":0},{"$f":"SUM(IF(MID(Arbeitgeberkosten!$E$7:$E$22,3,1)=\"E\",Arbeitgeberkosten!P7:P22,0))","v":0},{"$f":"SUM(IF(MID(Arbeitgeberkosten!$E$7:$E$22,3,1)=\"E\",Arbeitgeberkosten!Q7:Q22,0))","v":0}]
["Hinzurechnungsbetrag 1",{"$f":"Arbeitgeberkosten!F25","v":0},{"$f":"Arbeitgeberkosten!G25","v":0},{"$f":"Arbeitgeberkosten!H25","v":0},{"$f":"Arbeitgeberkosten!I25","v":0},{"$f":"Arbeitgeberkosten!J25","v":0},{"$f":"Arbeitgeberkosten!K25","v":0},{"$f":"Arbeitgeberkosten!L25","v":0},{"$f":"Arbeitgeberkosten!M25","v":0},{"$f":"Arbeitgeberkosten!N25","v":0},{"$f":"Arbeitgeberkosten!O25","v":0},{"$f":"Arbeitgeberkosten!P25","v":0},{"$f":"Arbeitgeberkosten!Q25","v":0}]
["Hinzurechnungsbetrag 2",{"$f":"Arbeitgeberkosten!F27","v":0},{"$f":"Arbeitgeberkosten!G27","v":0},{"$f":"Arbeitgeberkosten!H27","v":0},{"$f":"Arbeitgeberkosten!I27","v":0},{"$f":"Arbeitgeberkosten!J27","v":0},{"$f":"Arbeitgeberkosten!K27","v":0},{"$f":"Arbeitgeberkosten!L27","v":0},{"$f":"Arbeitgeberkosten!M27","v":0},{"$f":"Arbeitgeberkosten!N27","v":0},{"$f":"Arbeitgeberkosten!O27","v":0},{"$f":"Arbeitgeberkosten!P27","v":0},{"$f":"Arbeitgeberkosten!Q27","v":0}]
["Bereinigtes SVBrutto:",{"$f":"B149-SUM(B151:B153)","v":6.65},{"$f":"C149-SUM(C151:C153)","v":6.65},6.65,6.65,6.65,6.65,6.65,6.65,6.65,6.65,6.65,6.65]
["Hinzur. Betrag 1 Anteil SV Monat",{"$f":"IF(AND(B154>0,SUM(Arbeitgeberkosten!F19:F21)>=150),ROUNDDOWN(B152*B154/(B154+B151),2),B152)","v":0},{"$f":"IF(AND(C154>0,SUM(Arbeitgeberkosten!G19:G21)<=150),ROUNDDOWN(C152*C154/(C154+C151),2),C152)","v":0},{"$f":"IF(AND(D154>0,SUM(Arbeitgeberkosten!H19:H21)<=150),ROUNDDOWN(D152*D154/(D154+D151),2),D152)","v":0},{"$f":"IF(AND(E154>0,SUM(Arbeitgeberkosten!I19:I21)<=150),ROUNDDOWN(E152*E154/(E154+E151),2),E152)","v":0},{"$f":"IF(AND(F154>0,SUM(Arbeitgeberkosten!J19:J21)<=150),ROUNDDOWN(F152*F154/(F154+F151),2),F152)","v":0},{"$f":"IF(AND(G154>0,SUM(Arbeitgeberkosten!K19:K21)<=150),ROUNDDOWN(G152*G154/(G154+G151),2),G152)","v":0},{"$f":"IF(AND(H154>0,SUM(Arbeitgeberkosten!L19:L21)<=150),ROUNDDOWN(H152*H154/(H154+H151),2),H152)","v":0},{"$f":"IF(AND(I154>0,SUM(Arbeitgeberkosten!M19:M21)<=150),ROUNDDOWN(I152*I154/(I154+I151),2),I152)","v":0},{"$f":"IF(AND(J154>0,SUM(Arbeitgeberkosten!N19:N21)<=150),ROUNDDOWN(J152*J154/(J154+J151),2),J152)","v":0},{"$f":"IF(AND(K154>0,SUM(Arbeitgeberkosten!O19:O21)<=150),ROUNDDOWN(K152*K154/(K154+K151),2),K152)","v":0},{"$f":"IF(AND(L154>0,SUM(Arbeitgeberkosten!P19:P21)<=150),ROUNDDOWN(L152*L154/(L154+L151),2),L152)","v":0},{"$f":"IF(AND(M154>0,SUM(Arbeitgeberkosten!Q19:Q21)<=150),ROUNDDOWN(M152*M154/(M154+M151),2),M152)","v":0}]
["Hinzur. Betrag 2 Anteil SV Monat",{"$f":"IF(B154>0,ROUNDDOWN(B153*B154/(B154+B151),2),B153)","v":0},{"$f":"IF(C154>0,ROUNDDOWN(C153*C154/(C154+C151),2),C153)","v":0},0,0,0,0,0,0,0,0,0,0]
["Hinzur. Betrag 1 Anteil EGA",{"$f":"B152-B155","v":0},{"$f":"C152-C155","v":0},0,0,0,0,0,0,0,0,0,0]
["Hinzur. Betrag 2 Anteil EGA",{"$f":"B153-B156","v":0},{"$f":"C153-C156","v":0},0,0,0,0,0,0,0,0,0,0]
["Bemessungsgrenze KV",{"$f":"Datenausgabe!B133","v":4687.5},{"$f":"Datenausgabe!C133","v":4687.5},{"$f":"Datenausgabe!D133","v":4687.5},{"$f":"Datenausgabe!E133","v":4687.5},{"$f":"Datenausgabe!F133","v":4687.5},{"$f":"Datenausgabe!G133","v":4687.5},{"$f":"Datenausgabe!H133","v":4687.5},{"$f":"Datenausgabe!I133","v":4687.5},{"$f":"Datenausgabe!J133","v":4687.5},{"$f":"Datenausgabe!K133","v":4687.5},{"$f":"Datenausgabe!L133","v":4687.5},{"$f":"Datenausgabe!M133","v":4687.5}]
["KV =",{"$f":"IF(Datenausgabe!B129,IF(SUM(B154:B156,IF(B150,0,B157:B158))>B159,B159,SUM(B154:B156,IF(B150,0,B157:B158))),0)","v":6.65},{"$f":"IF(Datenausgabe!C129,IF(SUM(C154:C156,IF(C150,0,C157:C158))>C159,C159,SUM(C154:C156,IF(C150,0,C157:C158))),0)","v":6.65},{"$f":"IF(Datenausgabe!D129,IF(SUM(D154:D156,IF(D150,0,D157:D158))>D159,D159,SUM(D154:D156,IF(D150,0,D157:D158))),0)","v":6.65},{"$f":"IF(Datenausgabe!E129,IF(SUM(E154:E156,IF(E150,0,E157:E158))>E159,E159,SUM(E154:E156,IF(E150,0,E157:E158))),0)","v":6.65},{"$f":"IF(Datenausgabe!F129,IF(SUM(F154:F156,IF(F150,0,F157:F158))>F159,F159,SUM(F154:F156,IF(F150,0,F157:F158))),0)","v":6.65},{"$f":"IF(Datenausgabe!G129,IF(SUM(G154:G156,IF(G150,0,G157:G158))>G159,G159,SUM(G154:G156,IF(G150,0,G157:G158))),0)","v":6.65},{"$f":"IF(Datenausgabe!H129,IF(SUM(H154:H156,IF(H150,0,H157:H158))>H159,H159,SUM(H154:H156,IF(H150,0,H157:H158))),0)","v":6.65},{"$f":"IF(Datenausgabe!I129,IF(SUM(I154:I156,IF(I150,0,I157:I158))>I159,I159,SUM(I154:I156,IF(I150,0,I157:I158))),0)","v":6.65},{"$f":"IF(Datenausgabe!J129,IF(SUM(J154:J156,IF(J150,0,J157:J158))>J159,J159,SUM(J154:J156,IF(J150,0,J157:J158))),0)","v":6.65},{"$f":"IF(Datenausgabe!K129,IF(SUM(K154:K156,IF(K150,0,K157:K158))>K159,K159,SUM(K154:K156,IF(K150,0,K157:K158))),0)","v":6.65},{"$f":"IF(Datenausgabe!L129,IF(SUM(L154:L156,IF(L150,0,L157:L158))>L159,L159,SUM(L154:L156,IF(L150,0,L157:L158))),0)","v":6.65},{"$f":"IF(Datenausgabe!M129,IF(SUM(M154:M156,IF(M150,0,M157:M158))>M159,M159,SUM(M154:M156,IF(M150,0,M157:M158))),0)","v":6.65}]
["Bemessungsgrenze RV",{"$f":"Datenausgabe!B134","v":6900},{"$f":"Datenausgabe!C134","v":6900},{"$f":"Datenausgabe!D134","v":6900},{"$f":"Datenausgabe!E134","v":6900},{"$f":"Datenausgabe!F134","v":6900},{"$f":"Datenausgabe!G134","v":6900},{"$f":"Datenausgabe!H134","v":6900},{"$f":"Datenausgabe!I134","v":6900},{"$f":"Datenausgabe!J134","v":6900},{"$f":"Datenausgabe!K134","v":6900},{"$f":"Datenausgabe!L134","v":6900},{"$f":"Datenausgabe!M134","v":6900}]
["RV  =",{"$f":"IF(Datenausgabe!B129,IF(SUM(B154:B156,IF(B150,0,B157:B158))>B161,B161,SUM(B154:B156,IF(B150,0,B157:B158))),0)","v":6.65},{"$f":"IF(Datenausgabe!C129,IF(SUM(C154:C156,IF(C150,0,C157:C158))>C161,C161,SUM(C154:C156,IF(C150,0,C157:C158))),0)","v":6.65},{"$f":"IF(Datenausgabe!D129,IF(SUM(D154:D156,IF(D150,0,D157:D158))>D161,D161,SUM(D154:D156,IF(D150,0,D157:D158))),0)","v":6.65},{"$f":"IF(Datenausgabe!E129,IF(SUM(E154:E156,IF(E150,0,E157:E158))>E161,E161,SUM(E154:E156,IF(E150,0,E157:E158))),0)","v":6.65},{"$f":"IF(Datenausgabe!F129,IF(SUM(F154:F156,IF(F150,0,F157:F158))>F161,F161,SUM(F154:F156,IF(F150,0,F157:F158))),0)","v":6.65},{"$f":"IF(Datenausgabe!G129,IF(SUM(G154:G156,IF(G150,0,G157:G158))>G161,G161,SUM(G154:G156,IF(G150,0,G157:G158))),0)","v":6.65},{"$f":"IF(Datenausgabe!H129,IF(SUM(H154:H156,IF(H150,0,H157:H158))>H161,H161,SUM(H154:H156,IF(H150,0,H157:H158))),0)","v":6.65},{"$f":"IF(Datenausgabe!I129,IF(SUM(I154:I156,IF(I150,0,I157:I158))>I161,I161,SUM(I154:I156,IF(I150,0,I157:I158))),0)","v":6.65},{"$f":"IF(Datenausgabe!J129,IF(SUM(J154:J156,IF(J150,0,J157:J158))>J161,J161,SUM(J154:J156,IF(J150,0,J157:J158))),0)","v":6.65},{"$f":"IF(Datenausgabe!K129,IF(SUM(K154:K156,IF(K150,0,K157:K158))>K161,K161,SUM(K154:K156,IF(K150,0,K157:K158))),0)","v":6.65},{"$f":"IF(Datenausgabe!L129,IF(SUM(L154:L156,IF(L150,0,L157:L158))>L161,L161,SUM(L154:L156,IF(L150,0,L157:L158))),0)","v":6.65},{"$f":"IF(Datenausgabe!M129,IF(SUM(M154:M156,IF(M150,0,M157:M158))>M161,M161,SUM(M154:M156,IF(M150,0,M157:M158))),0)","v":6.65}]
["SV Brutto EGA-2"]
["Anteilige KV BBG",{"$f":"Datenausgabe!B$2*Datenausgabe!B133","v":4687.5},{"$f":"Datenausgabe!C$2*Datenausgabe!C133","v":9375},{"$f":"Datenausgabe!D$2*Datenausgabe!D133","v":14062.5},{"$f":"Datenausgabe!E$2*Datenausgabe!E133","v":18750},{"$f":"Datenausgabe!F$2*Datenausgabe!F133","v":23437.5},{"$f":"Datenausgabe!G$2*Datenausgabe!G133","v":28125},{"$f":"Datenausgabe!H$2*Datenausgabe!H133","v":32812.5},{"$f":"Datenausgabe!I$2*Datenausgabe!I133","v":37500},{"$f":"Datenausgabe!J$2*Datenausgabe!J133","v":42187.5},{"$f":"Datenausgabe!K$2*Datenausgabe!K133","v":46875},{"$f":"Datenausgabe!L$2*Datenausgabe!L133","v":51562.5},{"$f":"Datenausgabe!M$2*Datenausgabe!M133","v":56250}]
["Anteilige RV BBG",{"$f":"Datenausgabe!B$2*Datenausgabe!B134","v":6900},{"$f":"Datenausgabe!C$2*Datenausgabe!C134","v":13800},{"$f":"Datenausgabe!D$2*Datenausgabe!D134","v":20700},{"$f":"Datenausgabe!E$2*Datenausgabe!E134","v":27600},{"$f":"Datenausgabe!F$2*Datenausgabe!F134","v":34500},{"$f":"Datenausgabe!G$2*Datenausgabe!G134","v":41400},{"$f":"Datenausgabe!H$2*Datenausgabe!H134","v":48300},{"$f":"Datenausgabe!I$2*Datenausgabe!I134","v":55200},{"$f":"Datenausgabe!J$2*Datenausgabe!J134","v":62100},{"$f":"Datenausgabe!K$2*Datenausgabe!K134","v":69000},{"$f":"Datenausgabe!L$2*Datenausgabe!L134","v":75900},{"$f":"Datenausgabe!M$2*Datenausgabe!M134","v":82800}]
["EZ mit Hinzurechnungsanteilen",{"$f":"B151+IF(B150,SUM(B157:B158),0)","v":0},{"$f":"C151+IF(C150,SUM(C157:C158),0)","v":0},0,0,0,0,0,0,0,0,0,0]
["Bis einschl.. diesen Monat verbr. KV",{"$f":"SUM(Arbeitgeberkosten!$F$29:F29)+SUM(Arbeitgeberkosten!$E$31:E31)","v":6.65},{"$f":"SUM(Arbeitgeberkosten!$F$29:G29)+SUM(Arbeitgeberkosten!$E$31:F31)","v":13.3},{"$f":"SUM(Arbeitgeberkosten!$F$29:H29)+SUM(Arbeitgeberkosten!$E$31:G31)","v":19.95},{"$f":"SUM(Arbeitgeberkosten!$F$29:I29)+SUM(Arbeitgeberkosten!$E$31:H31)","v":26.6},{"$f":"SUM(Arbeitgeberkosten!$F$29:J29)+SUM(Arbeitgeberkosten!$E$31:I31)","v":33.25},{"$f":"SUM(Arbeitgeberkosten!$F$29:K29)+SUM(Arbeitgeberkosten!$E$31:J31)","v":39.9},{"$f":"SUM(Arbeitgeberkosten!$F$29:L29)+SUM(Arbeitgeberkosten!$E$31:K31)","v":46.55},{"$f":"SUM(Arbeitgeberkosten!$F$29:M29)+SUM(Arbeitgeberkosten!$E$31:L31)","v":53.2},{"$f":"SUM(Arbeitgeberkosten!$F$29:N29)+SUM(Arbeitgeberkosten!$E$31:M31)","v":59.85},{"$f":"SUM(Arbeitgeberkosten!$F$29:O29)+SUM(Arbeitgeberkosten!$E$31:N31)","v":66.5},{"$f":"SUM(Arbeitgeberkosten!$F$29:P29)+SUM(Arbeitgeberkosten!$E$31:O31)","v":73.150000000000006},{"$f":"SUM(Arbeitgeberkosten!$F$29:Q29)+SUM(Arbeitgeberkosten!$E$31:P31)","v":79.8}]
["Bis einschl.. diesen Monat verbr. RV",{"$f":"SUM(Arbeitgeberkosten!$F$30:F30)+SUM(Arbeitgeberkosten!$E$32:E32)","v":6.65},{"$f":"SUM(Arbeitgeberkosten!$F$30:G30)+SUM(Arbeitgeberkosten!$E$32:F32)","v":13.3},{"$f":"SUM(Arbeitgeberkosten!$F$30:H30)+SUM(Arbeitgeberkosten!$E$32:G32)","v":19.95},{"$f":"SUM(Arbeitgeberkosten!$F$30:I30)+SUM(Arbeitgeberkosten!$E$32:H32)","v":26.6},{"$f":"SUM(Arbeitgeberkosten!$F$30:J30)+SUM(Arbeitgeberkosten!$E$32:I32)","v":33.25},{"$f":"SUM(Arbeitgeberkosten!$F$30:K30)+SUM(Arbeitgeberkosten!$E$32:J32)","v":39.9},{"$f":"SUM(Arbeitgeberkosten!$F$30:L30)+SUM(Arbeitgeberkosten!$E$32:K32)","v":46.55},{"$f":"SUM(Arbeitgeberkosten!$F$30:M30)+SUM(Arbeitgeberkosten!$E$32:L32)","v":53.2},{"$f":"SUM(Arbeitgeberkosten!$F$30:N30)+SUM(Arbeitgeberkosten!$E$32:M32)","v":59.85},{"$f":"SUM(Arbeitgeberkosten!$F$30:O30)+SUM(Arbeitgeberkosten!$E$32:N32)","v":66.5},{"$f":"SUM(Arbeitgeberkosten!$F$30:P30)+SUM(Arbeitgeberkosten!$E$32:O32)","v":73.150000000000006},{"$f":"SUM(Arbeitgeberkosten!$F$30:Q30)+SUM(Arbeitgeberkosten!$E$32:P32)","v":79.8}]
["Verfügbar für EZ - KV",{"$f":"IF(B164>=B167,B164-B167,0)","v":4680.8500000000004},{"$f":"IF(C164>=C167,C164-C167,0)","v":9361.7000000000007},14042.55,18723.400000000001,23404.25,28085.1,32765.95,37446.800000000003,42127.65,46808.5,51489.35,56170.2]
["Verfügbar für EZ - RV",{"$f":"IF(B165>=B168,B165-B168,0)","v":6893.35},{"$f":"IF(C165>=C168,C165-C168,0)","v":13786.7},20680.05,27573.4,34466.75,41360.1,48253.45,55146.8,62040.15,68933.5,75826.850000000006,82720.2]
["EGA 2 KV",{"$f":"IF(Datenausgabe!B129,IF(B169>B$166,B$166,B169),0)","v":0},{"$f":"IF(Datenausgabe!C129,IF(C169>C$166,C$166,C169),0)","v":0},{"$f":"IF(Datenausgabe!D129,IF(D169>D$166,D$166,D169),0)","v":0},{"$f":"IF(Datenausgabe!E129,IF(E169>E$166,E$166,E169),0)","v":0},{"$f":"IF(Datenausgabe!F129,IF(F169>F$166,F$166,F169),0)","v":0},{"$f":"IF(Datenausgabe!G129,IF(G169>G$166,G$166,G169),0)","v":0},{"$f":"IF(Datenausgabe!H129,IF(H169>H$166,H$166,H169),0)","v":0},{"$f":"IF(Datenausgabe!I129,IF(I169>I$166,I$166,I169),0)","v":0},{"$f":"IF(Datenausgabe!J129,IF(J169>J$166,J$166,J169),0)","v":0},{"$f":"IF(Datenausgabe!K129,IF(K169>K$166,K$166,K169),0)","v":0},{"$f":"IF(Datenausgabe!L129,IF(L169>L$166,L$166,L169),0)","v":0},{"$f":"IF(Datenausgabe!M129,IF(M169>M$166,M$166,M169),0)","v":0}]
["EGA 2 RV",{"$f":"IF(Datenausgabe!B129,IF(B170>B$166,B$166,B170),0)","v":0},{"$f":"IF(Datenausgabe!C129,IF(C170>C$166,C$166,C170),0)","v":0},{"$f":"IF(Datenausgabe!D129,IF(D170>D$166,D$166,D170),0)","v":0},{"$f":"IF(Datenausgabe!E129,IF(E170>E$166,E$166,E170),0)","v":0},{"$f":"IF(Datenausgabe!F129,IF(F170>F$166,F$166,F170),0)","v":0},{"$f":"IF(Datenausgabe!G129,IF(G170>G$166,G$166,G170),0)","v":0},{"$f":"IF(Datenausgabe!H129,IF(H170>H$166,H$166,H170),0)","v":0},{"$f":"IF(Datenausgabe!I129,IF(I170>I$166,I$166,I170),0)","v":0},{"$f":"IF(Datenausgabe!J129,IF(J170>J$166,J$166,J170),0)","v":0},{"$f":"IF(Datenausgabe!K129,IF(K170>K$166,K$166,K170),0)","v":0},{"$f":"IF(Datenausgabe!L129,IF(L170>L$166,L$166,L170),0)","v":0},{"$f":"IF(Datenausgabe!M129,IF(M170>M$166,M$166,M170),0)","v":0}]
["Gleitzone"]
["Tatsächliches Entgelt:",{"$f":"Arbeitgeberkosten!F28","v":6.65},{"$f":"Arbeitgeberkosten!G28","v":6.65},{"$f":"Arbeitgeberkosten!H28","v":6.65},{"$f":"Arbeitgeberkosten!I28","v":6.65},{"$f":"Arbeitgeberkosten!J28","v":6.65},{"$f":"Arbeitgeberkosten!K28","v":6.65},{"$f":"Arbeitgeberkosten!L28","v":6.65},{"$f":"Arbeitgeberkosten!M28","v":6.65},{"$f":"Arbeitgeberkosten!N28","v":6.65},{"$f":"Arbeitgeberkosten!O28","v":6.65},{"$f":"Arbeitgeberkosten!P28","v":6.65},{"$f":"Arbeitgeberkosten!Q28","v":6.65}]
["F * 450 + ([850/(850-450)] - [450/(850-450)] * F) * (Arbeitsentgelt - 450)\n"]
[]
["Beitragspflichtiges Entgelt",{"$f":"IF(B174<>0,IF(B174>Datenausgabe!B180,Datenausgabe!B178*Datenausgabe!B180+((Datenausgabe!B179/(Datenausgabe!B179-Datenausgabe!B180))-(Datenausgabe!B180/(Datenausgabe!B179-Datenausgabe!B180))*Datenausgabe!B178)*(B174-Datenausgabe!B180),B174*Datenausgabe!B178),0)","v":5.01},{"$f":"IF(C174<>0,IF(C174>Datenausgabe!C180,Datenausgabe!C178*Datenausgabe!C180+((Datenausgabe!C179/(Datenausgabe!C179-Datenausgabe!C180))-(Datenausgabe!C180/(Datenausgabe!C179-Datenausgabe!C180))*Datenausgabe!C178)*(C174-Datenausgabe!C180),C174*Datenausgabe!C178),0)","v":5.01},{"$f":"IF(D174<>0,IF(D174>Datenausgabe!D180,Datenausgabe!D178*Datenausgabe!D180+((Datenausgabe!D179/(Datenausgabe!D179-Datenausgabe!D180))-(Datenausgabe!D180/(Datenausgabe!D179-Datenausgabe!D180))*Datenausgabe!D178)*(D174-Datenausgabe!D180),D174*Datenausgabe!D178),0)","v":5.01},{"$f":"IF(E174<>0,IF(E174>Datenausgabe!E180,Datenausgabe!E178*Datenausgabe!E180+((Datenausgabe!E179/(Datenausgabe!E179-Datenausgabe!E180))-(Datenausgabe!E180/(Datenausgabe!E179-Datenausgabe!E180))*Datenausgabe!E178)*(E174-Datenausgabe!E180),E174*Datenausgabe!E178),0)","v":5.01},{"$f":"IF(F174<>0,IF(F174>Datenausgabe!F180,Datenausgabe!F178*Datenausgabe!F180+((Datenausgabe!F179/(Datenausgabe!F179-Datenausgabe!F180))-(Datenausgabe!F180/(Datenausgabe!F179-Datenausgabe!F180))*Datenausgabe!F178)*(F174-Datenausgabe!F180),F174*Datenausgabe!F178),0)","v":5.01},{"$f":"IF(G174<>0,IF(G174>Datenausgabe!G180,Datenausgabe!G178*Datenausgabe!G180+((Datenausgabe!G179/(Datenausgabe!G179-Datenausgabe!G180))-(Datenausgabe!G180/(Datenausgabe!G179-Datenausgabe!G180))*Datenausgabe!G178)*(G174-Datenausgabe!G180),G174*Datenausgabe!G178),0)","v":5.01},{"$f":"IF(H174<>0,IF(H174>Datenausgabe!H180,Datenausgabe!H178*Datenausgabe!H180+((Datenausgabe!H179/(Datenausgabe!H179-Datenausgabe!H180))-(Datenausgabe!H180/(Datenausgabe!H179-Datenausgabe!H180))*Datenausgabe!H178)*(H174-Datenausgabe!H180),H174*Datenausgabe!H178),0)","v":5.01},{"$f":"IF(I174<>0,IF(I174>Datenausgabe!I180,Datenausgabe!I178*Datenausgabe!I180+((Datenausgabe!I179/(Datenausgabe!I179-Datenausgabe!I180))-(Datenausgabe!I180/(Datenausgabe!I179-Datenausgabe!I180))*Datenausgabe!I178)*(I174-Datenausgabe!I180),I174*Datenausgabe!I178),0)","v":5.01},{"$f":"IF(J174<>0,IF(J174>Datenausgabe!J180,Datenausgabe!J178*Datenausgabe!J180+((Datenausgabe!J179/(Datenausgabe!J179-Datenausgabe!J180))-(Datenausgabe!J180/(Datenausgabe!J179-Datenausgabe!J180))*Datenausgabe!J178)*(J174-Datenausgabe!J180),J174*Datenausgabe!J178),0)","v":5.01},{"$f":"IF(K174<>0,IF(K174>Datenausgabe!K180,Datenausgabe!K178*Datenausgabe!K180+((Datenausgabe!K179/(Datenausgabe!K179-Datenausgabe!K180))-(Datenausgabe!K180/(Datenausgabe!K179-Datenausgabe!K180))*Datenausgabe!K178)*(K174-Datenausgabe!K180),K174*Datenausgabe!K178),0)","v":5.01},{"$f":"IF(L174<>0,IF(L174>Datenausgabe!L180,Datenausgabe!L178*Datenausgabe!L180+((Datenausgabe!L179/(Datenausgabe!L179-Datenausgabe!L180))-(Datenausgabe!L180/(Datenausgabe!L179-Datenausgabe!L180))*Datenausgabe!L178)*(L174-Datenausgabe!L180),L174*Datenausgabe!L178),0)","v":5.01},{"$f":"IF(M174<>0,IF(M174>Datenausgabe!M180,Datenausgabe!M178*Datenausgabe!M180+((Datenausgabe!M179/(Datenausgabe!M179-Datenausgabe!M180))-(Datenausgabe!M180/(Datenausgabe!M179-Datenausgabe!M180))*Datenausgabe!M178)*(M174-Datenausgabe!M180),M174*Datenausgabe!M178),0)","v":5.01}]
["Gesamtbeitrag:"]
["KV",{"$f":"B$177*(Datenausgabe!B138+Datenausgabe!B142/2)/100*2","v":0.79},{"$f":"C$177*(Datenausgabe!C138+Datenausgabe!C142/2)/100*2","v":0.79},{"$f":"D$177*(Datenausgabe!D138+Datenausgabe!D142/2)/100*2","v":0.79},{"$f":"E$177*(Datenausgabe!E138+Datenausgabe!E142/2)/100*2","v":0.79},{"$f":"F$177*(Datenausgabe!F138+Datenausgabe!F142/2)/100*2","v":0.79},{"$f":"G$177*(Datenausgabe!G138+Datenausgabe!G142/2)/100*2","v":0.79},{"$f":"H$177*(Datenausgabe!H138+Datenausgabe!H142/2)/100*2","v":0.79},{"$f":"I$177*(Datenausgabe!I138+Datenausgabe!I142/2)/100*2","v":0.79},{"$f":"J$177*(Datenausgabe!J138+Datenausgabe!J142/2)/100*2","v":0.79},{"$f":"K$177*(Datenausgabe!K138+Datenausgabe!K142/2)/100*2","v":0.79},{"$f":"L$177*(Datenausgabe!L138+Datenausgabe!L142/2)/100*2","v":0.79},{"$f":"M$177*(Datenausgabe!M138+Datenausgabe!M142/2)/100*2","v":0.79}]
["PV",{"$f":"B$177*Datenausgabe!B139/100*2","v":0.15},{"$f":"C$177*Datenausgabe!C139/100*2","v":0.15},{"$f":"D$177*Datenausgabe!D139/100*2","v":0.15},{"$f":"E$177*Datenausgabe!E139/100*2","v":0.15},{"$f":"F$177*Datenausgabe!F139/100*2","v":0.15},{"$f":"G$177*Datenausgabe!G139/100*2","v":0.15},{"$f":"H$177*Datenausgabe!H139/100*2","v":0.15},{"$f":"I$177*Datenausgabe!I139/100*2","v":0.15},{"$f":"J$177*Datenausgabe!J139/100*2","v":0.15},{"$f":"K$177*Datenausgabe!K139/100*2","v":0.15},{"$f":"L$177*Datenausgabe!L139/100*2","v":0.15},{"$f":"M$177*Datenausgabe!M139/100*2","v":0.15}]
["RV",{"$f":"IF(Datenausgabe!B176,B$174,B$177)*Datenausgabe!B140/100*2","v":0.93},{"$f":"IF(Datenausgabe!C176,C$174,C$177)*Datenausgabe!C140/100*2","v":0.93},{"$f":"IF(Datenausgabe!D176,D$174,D$177)*Datenausgabe!D140/100*2","v":0.93},{"$f":"IF(Datenausgabe!E176,E$174,E$177)*Datenausgabe!E140/100*2","v":0.93},{"$f":"IF(Datenausgabe!F176,F$174,F$177)*Datenausgabe!F140/100*2","v":0.93},{"$f":"IF(Datenausgabe!G176,G$174,G$177)*Datenausgabe!G140/100*2","v":0.93},{"$f":"IF(Datenausgabe!H176,H$174,H$177)*Datenausgabe!H140/100*2","v":0.93},{"$f":"IF(Datenausgabe!I176,I$174,I$177)*Datenausgabe!I140/100*2","v":0.93},{"$f":"IF(Datenausgabe!J176,J$174,J$177)*Datenausgabe!J140/100*2","v":0.93},{"$f":"IF(Datenausgabe!K176,K$174,K$177)*Datenausgabe!K140/100*2","v":0.93},{"$f":"IF(Datenausgabe!L176,L$174,L$177)*Datenausgabe!L140/100*2","v":0.93},{"$f":"IF(Datenausgabe!M176,M$174,M$177)*Datenausgabe!M140/100*2","v":0.93}]
["AV",{"$f":"B$177*Datenausgabe!B141/100*2","v":0.12},{"$f":"C$177*Datenausgabe!C141/100*2","v":0.12},{"$f":"D$177*Datenausgabe!D141/100*2","v":0.12},{"$f":"E$177*Datenausgabe!E141/100*2","v":0.12},{"$f":"F$177*Datenausgabe!F141/100*2","v":0.12},{"$f":"G$177*Datenausgabe!G141/100*2","v":0.12},{"$f":"H$177*Datenausgabe!H141/100*2","v":0.12},{"$f":"I$177*Datenausgabe!I141/100*2","v":0.12},{"$f":"J$177*Datenausgabe!J141/100*2","v":0.12},{"$f":"K$177*Datenausgabe!K141/100*2","v":0.12},{"$f":"L$177*Datenausgabe!L141/100*2","v":0.12},{"$f":"M$177*Datenausgabe!M141/100*2","v":0.12}]
["Arbeitgeber"]
["KV",{"$f":"B$174*(Datenausgabe!B138+(Datenausgabe!B142/2))/100","v":0.52},{"$f":"C$174*(Datenausgabe!C138+(Datenausgabe!C142/2))/100","v":0.52},{"$f":"D$174*(Datenausgabe!D138+(Datenausgabe!D142/2))/100","v":0.52},{"$f":"E$174*(Datenausgabe!E138+(Datenausgabe!E142/2))/100","v":0.52},{"$f":"F$174*(Datenausgabe!F138+(Datenausgabe!F142/2))/100","v":0.52},{"$f":"G$174*(Datenausgabe!G138+(Datenausgabe!G142/2))/100","v":0.52},{"$f":"H$174*(Datenausgabe!H138+(Datenausgabe!H142/2))/100","v":0.52},{"$f":"I$174*(Datenausgabe!I138+(Datenausgabe!I142/2))/100","v":0.52},{"$f":"J$174*(Datenausgabe!J138+(Datenausgabe!J142/2))/100","v":0.52},{"$f":"K$174*(Datenausgabe!K138+(Datenausgabe!K142/2))/100","v":0.52},{"$f":"L$174*(Datenausgabe!L138+(Datenausgabe!L142/2))/100","v":0.52},{"$f":"M$174*(Datenausgabe!M138+(Datenausgabe!M142/2))/100","v":0.52}]
["PV",{"$f":"B$174*Datenausgabe!B139/100","v":0.1},{"$f":"C$174*Datenausgabe!C139/100","v":0.1},{"$f":"D$174*Datenausgabe!D139/100","v":0.1},{"$f":"E$174*Datenausgabe!E139/100","v":0.1},{"$f":"F$174*Datenausgabe!F139/100","v":0.1},{"$f":"G$174*Datenausgabe!G139/100","v":0.1},{"$f":"H$174*Datenausgabe!H139/100","v":0.1},{"$f":"I$174*Datenausgabe!I139/100","v":0.1},{"$f":"J$174*Datenausgabe!J139/100","v":0.1},{"$f":"K$174*Datenausgabe!K139/100","v":0.1},{"$f":"L$174*Datenausgabe!L139/100","v":0.1},{"$f":"M$174*Datenausgabe!M139/100","v":0.1}]
["RV",{"$f":"B$174*Datenausgabe!B140/100","v":0.62},{"$f":"C$174*Datenausgabe!C140/100","v":0.62},{"$f":"D$174*Datenausgabe!D140/100","v":0.62},{"$f":"E$174*Datenausgabe!E140/100","v":0.62},{"$f":"F$174*Datenausgabe!F140/100","v":0.62},{"$f":"G$174*Datenausgabe!G140/100","v":0.62},{"$f":"H$174*Datenausgabe!H140/100","v":0.62},{"$f":"I$174*Datenausgabe!I140/100","v":0.62},{"$f":"J$174*Datenausgabe!J140/100","v":0.62},{"$f":"K$174*Datenausgabe!K140/100","v":0.62},{"$f":"L$174*Datenausgabe!L140/100","v":0.62},{"$f":"M$174*Datenausgabe!M140/100","v":0.62}]
["AV",{"$f":"B$174*Datenausgabe!B141/100","v":0.08},{"$f":"C$174*Datenausgabe!C141/100","v":0.08},{"$f":"D$174*Datenausgabe!D141/100","v":0.08},{"$f":"E$174*Datenausgabe!E141/100","v":0.08},{"$f":"F$174*Datenausgabe!F141/100","v":0.08},{"$f":"G$174*Datenausgabe!G141/100","v":0.08},{"$f":"H$174*Datenausgabe!H141/100","v":0.08},{"$f":"I$174*Datenausgabe!I141/100","v":0.08},{"$f":"J$174*Datenausgabe!J141/100","v":0.08},{"$f":"K$174*Datenausgabe!K141/100","v":0.08},{"$f":"L$174*Datenausgabe!L141/100","v":0.08},{"$f":"M$174*Datenausgabe!M141/100","v":0.08}]
["Arbeitnehmer"]
["KV",{"$f":"B179-B184","v":0.27},{"$f":"C179-C184","v":0.27},0.27,0.27,0.27,0.27,0.27,0.27,0.27,0.27,0.27,0.27]
["PV",{"$f":"B180-B185+IF(Datenausgabe!B132,0,(B$177*Datenausgabe!B143/100))","v":0.06},{"$f":"C180-C185+IF(Datenausgabe!C132,0,(C$177*Datenausgabe!C143/100))","v":0.06},{"$f":"D180-D185+IF(Datenausgabe!D132,0,(D$177*Datenausgabe!D143/100))","v":0.06},{"$f":"E180-E185+IF(Datenausgabe!E132,0,(E$177*Datenausgabe!E143/100))","v":0.06},{"$f":"F180-F185+IF(Datenausgabe!F132,0,(F$177*Datenausgabe!F143/100))","v":0.06},{"$f":"G180-G185+IF(Datenausgabe!G132,0,(G$177*Datenausgabe!G143/100))","v":0.06},{"$f":"H180-H185+IF(Datenausgabe!H132,0,(H$177*Datenausgabe!H143/100))","v":0.06},{"$f":"I180-I185+IF(Datenausgabe!I132,0,(I$177*Datenausgabe!I143/100))","v":0.06},{"$f":"J180-J185+IF(Datenausgabe!J132,0,(J$177*Datenausgabe!J143/100))","v":0.06},{"$f":"K180-K185+IF(Datenausgabe!K132,0,(K$177*Datenausgabe!K143/100))","v":0.06},{"$f":"L180-L185+IF(Datenausgabe!L132,0,(L$177*Datenausgabe!L143/100))","v":0.06},{"$f":"M180-M185+IF(Datenausgabe!M132,0,(M$177*Datenausgabe!M143/100))","v":0.06}]
["RV",{"$f":"B181-B186+(B$177*Datenausgabe!B144/100)","v":0.31},{"$f":"C181-C186+(C$177*Datenausgabe!C144/100)","v":0.31},{"$f":"D181-D186+(D$177*Datenausgabe!D144/100)","v":0.31},{"$f":"E181-E186+(E$177*Datenausgabe!E144/100)","v":0.31},{"$f":"F181-F186+(F$177*Datenausgabe!F144/100)","v":0.31},{"$f":"G181-G186+(G$177*Datenausgabe!G144/100)","v":0.31},{"$f":"H181-H186+(H$177*Datenausgabe!H144/100)","v":0.31},{"$f":"I181-I186+(I$177*Datenausgabe!I144/100)","v":0.31},{"$f":"J181-J186+(J$177*Datenausgabe!J144/100)","v":0.31},{"$f":"K181-K186+(K$177*Datenausgabe!K144/100)","v":0.31},{"$f":"L181-L186+(L$177*Datenausgabe!L144/100)","v":0.31},{"$f":"M181-M186+(M$177*Datenausgabe!M144/100)","v":0.31}]
["AV",{"$f":"B182-B187+(B$177*Datenausgabe!B145/100)","v":0.04},{"$f":"C182-C187+(C$177*Datenausgabe!C145/100)","v":0.04},{"$f":"D182-D187+(D$177*Datenausgabe!D145/100)","v":0.04},{"$f":"E182-E187+(E$177*Datenausgabe!E145/100)","v":0.04},{"$f":"F182-F187+(F$177*Datenausgabe!F145/100)","v":0.04},{"$f":"G182-G187+(G$177*Datenausgabe!G145/100)","v":0.04},{"$f":"H182-H187+(H$177*Datenausgabe!H145/100)","v":0.04},{"$f":"I182-I187+(I$177*Datenausgabe!I145/100)","v":0.04},{"$f":"J182-J187+(J$177*Datenausgabe!J145/100)","v":0.04},{"$f":"K182-K187+(K$177*Datenausgabe!K145/100)","v":0.04},{"$f":"L182-L187+(L$177*Datenausgabe!L145/100)","v":0.04},{"$f":"M182-M187+(M$177*Datenausgabe!M145/100)","v":0.04}]
["KZVK Indiv. Steuerpflicht",{"$f":"SUM(B196:M196)","v":3312}]
["Umlage",{"$f":"Arbeitgeberkosten!F46","v":0},{"$f":"Arbeitgeberkosten!G46","v":0},{"$f":"Arbeitgeberkosten!H46","v":0},{"$f":"Arbeitgeberkosten!I46","v":0},{"$f":"Arbeitgeberkosten!J46","v":0},{"$f":"Arbeitgeberkosten!K46","v":0},{"$f":"Arbeitgeberkosten!L46","v":0},{"$f":"Arbeitgeberkosten!M46","v":0},{"$f":"Arbeitgeberkosten!N46","v":0},{"$f":"Arbeitgeberkosten!O46","v":0},{"$f":"Arbeitgeberkosten!P46","v":0},{"$f":"Arbeitgeberkosten!Q46","v":0}]
[null,{"$f":"B193","v":3312}]
["Steuerfrei",{"$f":"Datenausgabe!B134*Datenausgabe!B163/100","v":276},{"$f":"Datenausgabe!C134*Datenausgabe!C163/100","v":276},{"$f":"Datenausgabe!D134*Datenausgabe!D163/100","v":276},{"$f":"Datenausgabe!E134*Datenausgabe!E163/100","v":276},{"$f":"Datenausgabe!F134*Datenausgabe!F163/100","v":276},{"$f":"Datenausgabe!G134*Datenausgabe!G163/100","v":276},{"$f":"Datenausgabe!H134*Datenausgabe!H163/100","v":276},{"$f":"Datenausgabe!I134*Datenausgabe!I163/100","v":276},{"$f":"Datenausgabe!J134*Datenausgabe!J163/100","v":276},{"$f":"Datenausgabe!K134*Datenausgabe!K163/100","v":276},{"$f":"Datenausgabe!L134*Datenausgabe!L163/100","v":276},{"$f":"Datenausgabe!M134*Datenausgabe!M163/100","v":276}]
["Steuerpflichtig",{"$f":"IF(SUM($B$194:B194)-$B$195>0,SUM($B$194:B194)-$B$195,0)","v":0},{"$f":"IF(SUM($B$194:C194)-$B$195>0,SUM($B$194:C194)-$B$195,0)","v":0},{"$f":"IF(SUM($B$194:D194)-$B$195>0,SUM($B$194:D194)-$B$195,0)","v":0},{"$f":"IF(SUM($B$194:E194)-$B$195>0,SUM($B$194:E194)-$B$195,0)","v":0},{"$f":"IF(SUM($B$194:F194)-$B$195>0,SUM($B$194:F194)-$B$195,0)","v":0},{"$f":"IF(SUM($B$194:G194)-$B$195>0,SUM($B$194:G194)-$B$195,0)","v":0},{"$f":"IF(SUM($B$194:H194)-$B$195>0,SUM($B$194:H194)-$B$195,0)","v":0},{"$f":"IF(SUM($B$194:I194)-$B$195>0,SUM($B$194:I194)-$B$195,0)","v":0},{"$f":"IF(SUM($B$194:J194)-$B$195>0,SUM($B$194:J194)-$B$195,0)","v":0},{"$f":"IF(SUM($B$194:K194)-$B$195>0,SUM($B$194:K194)-$B$195,0)","v":0},{"$f":"IF(SUM($B$194:L194)-$B$195>0,SUM($B$194:L194)-$B$195,0)","v":0},{"$f":"IF(SUM($B$194:M194)-$B$195>0,SUM($B$194:M194)-$B$195,0)","v":0}]
["Steuern"]
["RV_frei",{"$f":"IF(OR(LEFT(Datenausgabe!B4,4)=\"BesO\",Datenausgabe!B4=\"Priester\"),2,0)","v":0},{"$f":"IF(OR(LEFT(Datenausgabe!C4,4)=\"BesO\",Datenausgabe!C4=\"Priester\"),2,0)","v":0},{"$f":"IF(OR(LEFT(Datenausgabe!D4,4)=\"BesO\",Datenausgabe!D4=\"Priester\"),2,0)","v":0},{"$f":"IF(OR(LEFT(Datenausgabe!E4,4)=\"BesO\",Datenausgabe!E4=\"Priester\"),2,0)","v":0},{"$f":"IF(OR(LEFT(Datenausgabe!F4,4)=\"BesO\",Datenausgabe!F4=\"Priester\"),2,0)","v":0},{"$f":"IF(OR(LEFT(Datenausgabe!G4,4)=\"BesO\",Datenausgabe!G4=\"Priester\"),2,0)","v":0},{"$f":"IF(OR(LEFT(Datenausgabe!H4,4)=\"BesO\",Datenausgabe!H4=\"Priester\"),2,0)","v":0},{"$f":"IF(OR(LEFT(Datenausgabe!I4,4)=\"BesO\",Datenausgabe!I4=\"Priester\"),2,0)","v":0},{"$f":"IF(OR(LEFT(Datenausgabe!J4,4)=\"BesO\",Datenausgabe!J4=\"Priester\"),2,0)","v":0},{"$f":"IF(OR(LEFT(Datenausgabe!K4,4)=\"BesO\",Datenausgabe!K4=\"Priester\"),2,0)","v":0},{"$f":"IF(OR(LEFT(Datenausgabe!L4,4)=\"BesO\",Datenausgabe!L4=\"Priester\"),2,0)","v":0},{"$f":"IF(OR(LEFT(Datenausgabe!M4,4)=\"BesO\",Datenausgabe!M4=\"Priester\"),2,0)","v":0}]
["Zahlungszeitraum",2,2,2,2,2,2,2,2,2,2,2,2]
["AltersE",{"$f":"IF(Datenausgabe!B119,1,0)","v":0},{"$f":"IF(Datenausgabe!C119,1,0)","v":0},{"$f":"IF(Datenausgabe!D119,1,0)","v":0},{"$f":"IF(Datenausgabe!E119,1,0)","v":0},{"$f":"IF(Datenausgabe!F119,1,0)","v":0},{"$f":"IF(Datenausgabe!G119,1,0)","v":0},{"$f":"IF(Datenausgabe!H119,1,0)","v":0},{"$f":"IF(Datenausgabe!I119,1,0)","v":0},{"$f":"IF(Datenausgabe!J119,1,0)","v":0},{"$f":"IF(Datenausgabe!K119,1,0)","v":0},{"$f":"IF(Datenausgabe!L119,1,0)","v":0},{"$f":"IF(Datenausgabe!M119,1,0)","v":0}]
["Entgelt",{"$f":"'Nettoberechnung Jahr'!F35-B211","v":6.65},{"$f":"'Nettoberechnung Jahr'!G35-C211","v":6.65},{"$f":"'Nettoberechnung Jahr'!H35-D211","v":6.65},{"$f":"'Nettoberechnung Jahr'!I35-E211","v":6.65},{"$f":"'Nettoberechnung Jahr'!J35-F211","v":6.65},{"$f":"'Nettoberechnung Jahr'!K35-G211","v":6.65},{"$f":"'Nettoberechnung Jahr'!L35-H211","v":6.65},{"$f":"'Nettoberechnung Jahr'!M35-I211","v":6.65},{"$f":"'Nettoberechnung Jahr'!N35-J211","v":6.65},{"$f":"'Nettoberechnung Jahr'!O35-K211","v":6.65},{"$f":"'Nettoberechnung Jahr'!P35-L211","v":6.65},{"$f":"'Nettoberechnung Jahr'!Q35-M211","v":6.65}]
["VBEZ_enth",{"$f":"IF(Datenausgabe!B82,B202,0)","v":0},{"$f":"IF(Datenausgabe!C82,C202,0)","v":0},{"$f":"IF(Datenausgabe!D82,D202,0)","v":0},{"$f":"IF(Datenausgabe!E82,E202,0)","v":0},{"$f":"IF(Datenausgabe!F82,F202,0)","v":0},{"$f":"IF(Datenausgabe!G82,G202,0)","v":0},{"$f":"IF(Datenausgabe!H82,H202,0)","v":0},{"$f":"IF(Datenausgabe!I82,I202,0)","v":0},{"$f":"IF(Datenausgabe!J82,J202,0)","v":0},{"$f":"IF(Datenausgabe!K82,K202,0)","v":0},{"$f":"IF(Datenausgabe!L82,L202,0)","v":0},{"$f":"IF(Datenausgabe!M82,M202,0)","v":0}]
["Steuertabelle",{"$f":"Datenausgabe!B104","v":0},{"$f":"Datenausgabe!C104","v":0},{"$f":"Datenausgabe!D104","v":0},{"$f":"Datenausgabe!E104","v":0},{"$f":"Datenausgabe!F104","v":0},{"$f":"Datenausgabe!G104","v":0},{"$f":"Datenausgabe!H104","v":0},{"$f":"Datenausgabe!I104","v":0},{"$f":"Datenausgabe!J104","v":0},{"$f":"Datenausgabe!K104","v":0},{"$f":"Datenausgabe!L104","v":0},{"$f":"Datenausgabe!M104","v":0}]
["Steuerklasse",{"$f":"Datenausgabe!B102","v":1},{"$f":"Datenausgabe!C102","v":1},{"$f":"Datenausgabe!D102","v":1},{"$f":"Datenausgabe!E102","v":1},{"$f":"Datenausgabe!F102","v":1},{"$f":"Datenausgabe!G102","v":1},{"$f":"Datenausgabe!H102","v":1},{"$f":"Datenausgabe!I102","v":1},{"$f":"Datenausgabe!J102","v":1},{"$f":"Datenausgabe!K102","v":1},{"$f":"Datenausgabe!L102","v":1},{"$f":"Datenausgabe!M102","v":1}]
["KindFB",{"$f":"Datenausgabe!B103","v":0},{"$f":"Datenausgabe!C103","v":0},{"$f":"Datenausgabe!D103","v":0},{"$f":"Datenausgabe!E103","v":0},{"$f":"Datenausgabe!F103","v":0},{"$f":"Datenausgabe!G103","v":0},{"$f":"Datenausgabe!H103","v":0},{"$f":"Datenausgabe!I103","v":0},{"$f":"Datenausgabe!J103","v":0},{"$f":"Datenausgabe!K103","v":0},{"$f":"Datenausgabe!L103","v":0},{"$f":"Datenausgabe!M103","v":0}]
["SteuerFB",{"$f":"Datenausgabe!B108","v":0},{"$f":"Datenausgabe!C108","v":0},{"$f":"Datenausgabe!D108","v":0},{"$f":"Datenausgabe!E108","v":0},{"$f":"Datenausgabe!F108","v":0},{"$f":"Datenausgabe!G108","v":0},{"$f":"Datenausgabe!H108","v":0},{"$f":"Datenausgabe!I108","v":0},{"$f":"Datenausgabe!J108","v":0},{"$f":"Datenausgabe!K108","v":0},{"$f":"Datenausgabe!L108","v":0},{"$f":"Datenausgabe!M108","v":0}]
["JahresFreib",{"$f":"Datenausgabe!B110","v":0},{"$f":"Datenausgabe!C110","v":0},{"$f":"Datenausgabe!D110","v":0},{"$f":"Datenausgabe!E110","v":0},{"$f":"Datenausgabe!F110","v":0},{"$f":"Datenausgabe!G110","v":0},{"$f":"Datenausgabe!H110","v":0},{"$f":"Datenausgabe!I110","v":0},{"$f":"Datenausgabe!J110","v":0},{"$f":"Datenausgabe!K110","v":0},{"$f":"Datenausgabe!L110","v":0},{"$f":"Datenausgabe!M110","v":0}]
["Jahresentgelt",{"$f":"SUM($B$202:B202)+((B202)*(12-Datenausgabe!B2))+SUM($B$211:B211)-B211","v":79.8},{"$f":"SUM($B$202:C202)+((C202)*(12-Datenausgabe!C2))+SUM($B$211:C211)-C211","v":79.8},{"$f":"SUM($B$202:D202)+((D202)*(12-Datenausgabe!D2))+SUM($B$211:D211)-D211","v":79.8},{"$f":"SUM($B$202:E202)+((E202)*(12-Datenausgabe!E2))+SUM($B$211:E211)-E211","v":79.8},{"$f":"SUM($B$202:F202)+((F202)*(12-Datenausgabe!F2))+SUM($B$211:F211)-F211","v":79.8},{"$f":"SUM($B$202:G202)+((G202)*(12-Datenausgabe!G2))+SUM($B$211:G211)-G211","v":79.8},{"$f":"SUM($B$202:H202)+((H202)*(12-Datenausgabe!H2))+SUM($B$211:H211)-H211","v":79.8},{"$f":"SUM($B$202:I202)+((I202)*(12-Datenausgabe!I2))+SUM($B$211:I211)-I211","v":79.8},{"$f":"SUM($B$202:J202)+((J202)*(12-Datenausgabe!J2))+SUM($B$211:J211)-J211","v":79.8},{"$f":"SUM($B$202:K202)+((K202)*(12-Datenausgabe!K2))+SUM($B$211:K211)-K211","v":79.8},{"$f":"SUM($B$202:L202)+((L202)*(12-Datenausgabe!L2))+SUM($B$211:L211)-L211","v":79.8},{"$f":"SUM($B$202:M202)+((M202)*(12-Datenausgabe!M2))+SUM($B$211:M211)-M211","v":79.8}]
["JahresVBEZ_enth",{"$f":"IF(Datenausgabe!B82,B209,0)","v":0},{"$f":"IF(Datenausgabe!C82,C209,0)","v":0},{"$f":"IF(Datenausgabe!D82,D209,0)","v":0},{"$f":"IF(Datenausgabe!E82,E209,0)","v":0},{"$f":"IF(Datenausgabe!F82,F209,0)","v":0},{"$f":"IF(Datenausgabe!G82,G209,0)","v":0},{"$f":"IF(Datenausgabe!H82,H209,0)","v":0},{"$f":"IF(Datenausgabe!I82,I209,0)","v":0},{"$f":"IF(Datenausgabe!J82,J209,0)","v":0},{"$f":"IF(Datenausgabe!K82,K209,0)","v":0},{"$f":"IF(Datenausgabe!L82,L209,0)","v":0},{"$f":"IF(Datenausgabe!M82,M209,0)","v":0}]
["SonstBezug",{"$f":"SUM(IF(MID('Nettoberechnung Jahr'!$E$6:$E$22,2,1)=\"S\",'Nettoberechnung Jahr'!F6:F22,0))","v":0},{"$f":"SUM(IF(MID('Nettoberechnung Jahr'!$E$6:$E$22,2,1)=\"S\",'Nettoberechnung Jahr'!G6:G22,0))","v":0},{"$f":"SUM(IF(MID('Nettoberechnung Jahr'!$E$6:$E$22,2,1)=\"S\",'Nettoberechnung Jahr'!H6:H22,0))","v":0},{"$f":"SUM(IF(MID('Nettoberechnung Jahr'!$E$6:$E$22,2,1)=\"S\",'Nettoberechnung Jahr'!I6:I22,0))","v":0},{"$f":"SUM(IF(MID('Nettoberechnung Jahr'!$E$6:$E$22,2,1)=\"S\",'Nettoberechnung Jahr'!J6:J22,0))","v":0},{"$f":"SUM(IF(MID('Nettoberechnung Jahr'!$E$6:$E$22,2,1)=\"S\",'Nettoberechnung Jahr'!K6:K22,0))","v":0},{"$f":"SUM(IF(MID('Nettoberechnung Jahr'!$E$6:$E$22,2,1)=\"S\",'Nettoberechnung Jahr'!L6:L22,0))","v":0},{"$f":"SUM(IF(MID('Nettoberechnung Jahr'!$E$6:$E$22,2,1)=\"S\",'Nettoberechnung Jahr'!M6:M22,0))","v":0},{"$f":"SUM(IF(MID('Nettoberechnung Jahr'!$E$6:$E$22,2,1)=\"S\",'Nettoberechnung Jahr'!N6:N22,0))","v":0},{"$f":"SUM(IF(MID('Nettoberechnung Jahr'!$E$6:$E$22,2,1)=\"S\",'Nettoberechnung Jahr'!O6:O22,0))","v":0},{"$f":"SUM(IF(MID('Nettoberechnung Jahr'!$E$6:$E$22,2,1)=\"S\",'Nettoberechnung Jahr'!P6:P22,0))","v":0},{"$f":"SUM(IF(MID('Nettoberechnung Jahr'!$E$6:$E$22,2,1)=\"S\",'Nettoberechnung Jahr'!Q6:Q22,0))","v":0}]
["SonstBezugVBEZ",{"$f":"IF(Datenausgabe!B82,B211,0)","v":0},{"$f":"IF(Datenausgabe!C82,C211,0)","v":0},{"$f":"IF(Datenausgabe!D82,D211,0)","v":0},{"$f":"IF(Datenausgabe!E82,E211,0)","v":0},{"$f":"IF(Datenausgabe!F82,F211,0)","v":0},{"$f":"IF(Datenausgabe!G82,G211,0)","v":0},{"$f":"IF(Datenausgabe!H82,H211,0)","v":0},{"$f":"IF(Datenausgabe!I82,I211,0)","v":0},{"$f":"IF(Datenausgabe!J82,J211,0)","v":0},{"$f":"IF(Datenausgabe!K82,K211,0)","v":0},{"$f":"IF(Datenausgabe!L82,L211,0)","v":0},{"$f":"IF(Datenausgabe!M82,M211,0)","v":0}]
["VergMehrj",0,0,0,0,0,0,0,0,0,0,0,0]
["VersBezJan",{"$f":"IF(Datenausgabe!B82,$B$202,0)","v":0}]
["VersSonderZ",{"$f":"Datenausgabe!B107","v":0},{"$f":"Datenausgabe!C107","v":0},{"$f":"Datenausgabe!D107","v":0},{"$f":"Datenausgabe!E107","v":0},{"$f":"Datenausgabe!F107","v":0},{"$f":"Datenausgabe!G107","v":0},{"$f":"Datenausgabe!H107","v":0},{"$f":"Datenausgabe!I107","v":0},{"$f":"Datenausgabe!J107","v":0},{"$f":"Datenausgabe!K107","v":0},{"$f":"Datenausgabe!L107","v":0},{"$f":"Datenausgabe!M107","v":0}]
["VersBezMon",12]
["HinzurBetrag",{"$f":"Datenausgabe!B109","v":0},{"$f":"Datenausgabe!C109","v":0},{"$f":"Datenausgabe!D109","v":0},{"$f":"Datenausgabe!E109","v":0},{"$f":"Datenausgabe!F109","v":0},{"$f":"Datenausgabe!G109","v":0},{"$f":"Datenausgabe!H109","v":0},{"$f":"Datenausgabe!I109","v":0},{"$f":"Datenausgabe!J109","v":0},{"$f":"Datenausgabe!K109","v":0},{"$f":"Datenausgabe!L109","v":0},{"$f":"Datenausgabe!M109","v":0}]
["JahresHinzurBetrag",{"$f":"Datenausgabe!B111","v":0},{"$f":"Datenausgabe!C111","v":0},{"$f":"Datenausgabe!D111","v":0},{"$f":"Datenausgabe!E111","v":0},{"$f":"Datenausgabe!F111","v":0},{"$f":"Datenausgabe!G111","v":0},{"$f":"Datenausgabe!H111","v":0},{"$f":"Datenausgabe!I111","v":0},{"$f":"Datenausgabe!J111","v":0},{"$f":"Datenausgabe!K111","v":0},{"$f":"Datenausgabe!L111","v":0},{"$f":"Datenausgabe!M111","v":0}]
["Geburtsjahr",{"$f":"Datenausgabe!B105","v":1960}]
["VersJahr",{"$f":"Datenausgabe!B106","v":0}]
["KVZUSAN %",{"$f":"Datenausgabe!B142","v":1.1000000000000001},{"$f":"Datenausgabe!C142","v":1.1000000000000001},{"$f":"Datenausgabe!D142","v":1.1000000000000001},{"$f":"Datenausgabe!E142","v":1.1000000000000001},{"$f":"Datenausgabe!F142","v":1.1000000000000001},{"$f":"Datenausgabe!G142","v":1.1000000000000001},{"$f":"Datenausgabe!H142","v":1.1000000000000001},{"$f":"Datenausgabe!I142","v":1.1000000000000001},{"$f":"Datenausgabe!J142","v":1.1000000000000001},{"$f":"Datenausgabe!K142","v":1.1000000000000001},{"$f":"Datenausgabe!L142","v":1.1000000000000001},{"$f":"Datenausgabe!M142","v":1.1000000000000001}]
["Faktor",{"$f":"Datenausgabe!B120","v":0},{"$f":"Datenausgabe!C120","v":0},{"$f":"Datenausgabe!D120","v":0},{"$f":"Datenausgabe!E120","v":0},{"$f":"Datenausgabe!F120","v":0},{"$f":"Datenausgabe!G120","v":0},{"$f":"Datenausgabe!H120","v":0},{"$f":"Datenausgabe!I120","v":0},{"$f":"Datenausgabe!J120","v":0},{"$f":"Datenausgabe!K120","v":0},{"$f":"Datenausgabe!L120","v":0},{"$f":"Datenausgabe!M120","v":0}]
[" KVPVBeitr",{"$f":"Datenausgabe!B121","v":0},{"$f":"Datenausgabe!C121","v":0},{"$f":"Datenausgabe!D121","v":0},{"$f":"Datenausgabe!E121","v":0},{"$f":"Datenausgabe!F121","v":0},{"$f":"Datenausgabe!G121","v":0},{"$f":"Datenausgabe!H121","v":0},{"$f":"Datenausgabe!I121","v":0},{"$f":"Datenausgabe!J121","v":0},{"$f":"Datenausgabe!K121","v":0},{"$f":"Datenausgabe!L121","v":0},{"$f":"Datenausgabe!M121","v":0}]
[" kvpfl",{"$f":"Datenausgabe!B122","v":0},{"$f":"Datenausgabe!C122","v":0},{"$f":"Datenausgabe!D122","v":0},{"$f":"Datenausgabe!E122","v":0},{"$f":"Datenausgabe!F122","v":0},{"$f":"Datenausgabe!G122","v":0},{"$f":"Datenausgabe!H122","v":0},{"$f":"Datenausgabe!I122","v":0},{"$f":"Datenausgabe!J122","v":0},{"$f":"Datenausgabe!K122","v":0},{"$f":"Datenausgabe!L122","v":0},{"$f":"Datenausgabe!M122","v":0}]
[" pvkind",{"$f":"IF(Datenausgabe!B132,0,1)","v":1},{"$f":"IF(Datenausgabe!C132,0,1)","v":1},{"$f":"IF(Datenausgabe!D132,0,1)","v":1},{"$f":"IF(Datenausgabe!E132,0,1)","v":1},{"$f":"IF(Datenausgabe!F132,0,1)","v":1},{"$f":"IF(Datenausgabe!G132,0,1)","v":1},{"$f":"IF(Datenausgabe!H132,0,1)","v":1},{"$f":"IF(Datenausgabe!I132,0,1)","v":1},{"$f":"IF(Datenausgabe!J132,0,1)","v":1},{"$f":"IF(Datenausgabe!K132,0,1)","v":1},{"$f":"IF(Datenausgabe!L132,0,1)","v":1},{"$f":"IF(Datenausgabe!M132,0,1)","v":1}]
["Pauschal versteuert:",{"$f":"IF(B147<>0,B141,0)","v":0},{"$f":"IF(C147<>0,C141,0)","v":0},0,0,0,0,0,0,0,0,0,0]
["Lohnsteuer",{"$f":"Lohnsteuer(1,B$199,B$200,B$201,B$202,B$203,B$205,B$206,B$207,B$217,B$208,B$218,B$209,B$210,B$211,B$212,B$213,$B$214,$B$215,$B$216,$B$219,$B$220,B$222,B$223,B$224,B$225,B$221)","v":0},{"$f":"Lohnsteuer(1,C$199,C$200,C$201,C$202,C$203,C$205,C$206,C$207,C$217,C$208,C$218,C$209,C$210,C$211,C$212,C$213,$B$214,$B$215,$B$216,$B$219,$B$220,C$222,C$223,C$224,C$225,C$221)","v":0},0,0,0,0,0,0,0,0,0,0]
["Kirchensteuer",{"$f":"Lohnsteuer(3,B$199,B$200,B$201,B$202,B$203,B$205,B$206,B$207,B$217,B$208,B$218,B$209,B$210,B$211,B$212,B$213,$B$214,$B$215,$B$216,$B$219,$B$220,B$222,B$223,B$224,B$225,B$221)","v":0},{"$f":"Lohnsteuer(3,C$199,C$200,C$201,C$202,C$203,C$205,C$206,C$207,C$217,C$208,C$218,C$209,C$210,C$211,C$212,C$213,$B$214,$B$215,$B$216,$B$219,$B$220,C$222,C$223,C$224,C$225,C$221)","v":0},0,0,0,0,0,0,0,0,0,0]
["Solidaritätszuschlag",{"$f":"Lohnsteuer(2,B$199,B$200,B$201,B$202,B$203,B$205,B$206,B$207,B$217,B$208,B$218,B$209,B$210,B$211,B$212,B$213,$B$214,$B$215,$B$216,$B$219,$B$220,B$222,B$223,B$224,B$225,B$221)","v":0},{"$f":"Lohnsteuer(2,C$199,C$200,C$201,C$202,C$203,C$205,C$206,C$207,C$217,C$208,C$218,C$209,C$210,C$211,C$212,C$213,$B$214,$B$215,$B$216,$B$219,$B$220,C$222,C$223,C$224,C$225,C$221)","v":0},0,0,0,0,0,0,0,0,0,0]
["Lohnsteuer SB",{"$f":"Lohnsteuer(9,B$199,B$200,B$201,B$202,B$203,B$205,B$206,B$207,B$217,B$208,B$218,B$209,B$210,B$211,B$212,B$213,$B$214,$B$215,$B$216,$B$219,$B$220,B$222,B$223,B$224,B$225,B$221)","v":0},{"$f":"Lohnsteuer(9,C$199,C$200,C$201,C$202,C$203,C$205,C$206,C$207,C$217,C$208,C$218,C$209,C$210,C$211,C$212,C$213,$B$214,$B$215,$B$216,$B$219,$B$220,C$222,C$223,C$224,C$225,C$221)","v":0},0,0,0,0,0,0,0,0,0,0]
["Kirchensteuer SB",{"$f":"Lohnsteuer(11,B$199,B$200,B$201,B$202,B$203,B$205,B$206,B$207,B$217,B$208,B$218,B$209,B$210,B$211,B$212,B$213,$B$214,$B$215,$B$216,$B$219,$B$220,B$222,B$223,B$224,B$225,B$221)","v":0},{"$f":"Lohnsteuer(11,C$199,C$200,C$201,C$202,C$203,C$205,C$206,C$207,C$217,C$208,C$218,C$209,C$210,C$211,C$212,C$213,$B$214,$B$215,$B$216,$B$219,$B$220,C$222,C$223,C$224,C$225,C$221)","v":0},0,0,0,0,0,0,0,0,0,0]
["Solidaritätszuschlag SB",{"$f":"Lohnsteuer(10,B$199,B$200,B$201,B$202,B$203,B$205,B$206,B$207,B$217,B$208,B$218,B$209,B$210,B$211,B$212,B$213,$B$214,$B$215,$B$216,$B$219,$B$220,B$222,B$223,B$224,B$225,B$221)","v":0},{"$f":"Lohnsteuer(10,C$199,C$200,C$201,C$202,C$203,C$205,C$206,C$207,C$217,C$208,C$218,C$209,C$210,C$211,C$212,C$213,$B$214,$B$215,$B$216,$B$219,$B$220,C$222,C$223,C$224,C$225,C$221)","v":0},0,0,0,0,0,0,0,0,0,0]
[]
["Höhergruppierung"]
["Höhergruppierung von:",{"$f":"IF(B237<>\"\",Datenausgabe!B6,\"\")","v":""},{"$f":"IF(C237<>\"\",Datenausgabe!C6,\"\")","v":""},{"$f":"IF(D237<>\"\",Datenausgabe!D6,\"\")","v":""},{"$f":"IF(E237<>\"\",Datenausgabe!E6,\"\")","v":""},{"$f":"IF(F237<>\"\",Datenausgabe!F6,\"\")","v":""},{"$f":"IF(G237<>\"\",Datenausgabe!G6,\"\")","v":""},{"$f":"IF(H237<>\"\",Datenausgabe!H6,\"\")","v":""},{"$f":"IF(I237<>\"\",Datenausgabe!I6,\"\")","v":""},{"$f":"IF(J237<>\"\",Datenausgabe!J6,\"\")","v":""},{"$f":"IF(K237<>\"\",Datenausgabe!K6,\"\")","v":""},{"$f":"IF(L237<>\"\",Datenausgabe!L6,\"\")","v":""},{"$f":"IF(M237<>\"\",Datenausgabe!M6,\"\")","v":""}]
["Stufe Alt",{"$f":"IF(B237<>\"\",Datenausgabe!B8,\"\")","v":""},{"$f":"IF(C237<>\"\",Datenausgabe!C8,\"\")","v":""},{"$f":"IF(D237<>\"\",Datenausgabe!D8,\"\")","v":""},{"$f":"IF(E237<>\"\",Datenausgabe!E8,\"\")","v":""},{"$f":"IF(F237<>\"\",Datenausgabe!F8,\"\")","v":""},{"$f":"IF(G237<>\"\",Datenausgabe!G8,\"\")","v":""},{"$f":"IF(H237<>\"\",Datenausgabe!H8,\"\")","v":""},{"$f":"IF(I237<>\"\",Datenausgabe!I8,\"\")","v":""},{"$f":"IF(J237<>\"\",Datenausgabe!J8,\"\")","v":""},{"$f":"IF(K237<>\"\",Datenausgabe!K8,\"\")","v":""},{"$f":"IF(L237<>\"\",Datenausgabe!L8,\"\")","v":""},{"$f":"IF(M237<>\"\",Datenausgabe!M8,\"\")","v":""}]
["Höhergruppierung nach:",{"$f":"IF(Datenausgabe!B86,Datenausgabe!B87,\"\")","v":""},{"$f":"IF(Datenausgabe!C86,Datenausgabe!C87,\"\")","v":""},{"$f":"IF(Datenausgabe!D86,Datenausgabe!D87,\"\")","v":""},{"$f":"IF(Datenausgabe!E86,Datenausgabe!E87,\"\")","v":""},{"$f":"IF(Datenausgabe!F86,Datenausgabe!F87,\"\")","v":""},{"$f":"IF(Datenausgabe!G86,Datenausgabe!G87,\"\")","v":""},{"$f":"IF(Datenausgabe!H86,Datenausgabe!H87,\"\")","v":""},{"$f":"IF(Datenausgabe!I86,Datenausgabe!I87,\"\")","v":""},{"$f":"IF(Datenausgabe!J86,Datenausgabe!J87,\"\")","v":""},{"$f":"IF(Datenausgabe!K86,Datenausgabe!K87,\"\")","v":""},{"$f":"IF(Datenausgabe!L86,Datenausgabe!L87,\"\")","v":""},{"$f":"IF(Datenausgabe!M86,Datenausgabe!M87,\"\")","v":""}]
["Entgelt ALT:",{"$f":"IF(B237<>\"\",IF(Datenausgabe!B10<>0,Datenausgabe!B10,B3),0)","v":0},{"$f":"IF(C237<>\"\",IF(Datenausgabe!C10<>0,Datenausgabe!C10,C3),0)","v":0},{"$f":"IF(D237<>\"\",IF(Datenausgabe!D10<>0,Datenausgabe!D10,D3),0)","v":0},{"$f":"IF(E237<>\"\",IF(Datenausgabe!E10<>0,Datenausgabe!E10,E3),0)","v":0},{"$f":"IF(F237<>\"\",IF(Datenausgabe!F10<>0,Datenausgabe!F10,F3),0)","v":0},{"$f":"IF(G237<>\"\",IF(Datenausgabe!G10<>0,Datenausgabe!G10,G3),0)","v":0},{"$f":"IF(H237<>\"\",IF(Datenausgabe!H10<>0,Datenausgabe!H10,H3),0)","v":0},{"$f":"IF(I237<>\"\",IF(Datenausgabe!I10<>0,Datenausgabe!I10,I3),0)","v":0},{"$f":"IF(J237<>\"\",IF(Datenausgabe!J10<>0,Datenausgabe!J10,J3),0)","v":0},{"$f":"IF(K237<>\"\",IF(Datenausgabe!K10<>0,Datenausgabe!K10,K3),0)","v":0},{"$f":"IF(L237<>\"\",IF(Datenausgabe!L10<>0,Datenausgabe!L10,L3),0)","v":0},{"$f":"IF(M237<>\"\",IF(Datenausgabe!M10<>0,Datenausgabe!M10,M3),0)","v":0}]
["Garantiebetrag:",{"$f":"IF(B237<>\"\",Datenausgabe!B88,0)","v":0},{"$f":"IF(C237<>\"\",Datenausgabe!C88,0)","v":0},{"$f":"IF(D237<>\"\",Datenausgabe!D88,0)","v":0},{"$f":"IF(E237<>\"\",Datenausgabe!E88,0)","v":0},{"$f":"IF(F237<>\"\",Datenausgabe!F88,0)","v":0},{"$f":"IF(G237<>\"\",Datenausgabe!G88,0)","v":0},{"$f":"IF(H237<>\"\",Datenausgabe!H88,0)","v":0},{"$f":"IF(I237<>\"\",Datenausgabe!I88,0)","v":0},{"$f":"IF(J237<>\"\",Datenausgabe!J88,0)","v":0},{"$f":"IF(K237<>\"\",Datenausgabe!K88,0)","v":0},{"$f":"IF(L237<>\"\",Datenausgabe!L88,0)","v":0},{"$f":"IF(M237<>\"\",Datenausgabe!M88,0)","v":0}]
["Neue Entgelttgruppe Stufe 1",{"$f":"VLOOKUP(Datenausgabe!B$87,[2]!Verguetung,1+1,0)","v":0},{"$f":"VLOOKUP(Datenausgabe!C$87,[2]!Verguetung,1+1,0)","v":0},{"$f":"VLOOKUP(Datenausgabe!D$87,[3]!Verguetung,1+1,0)","v":0},{"$f":"VLOOKUP(Datenausgabe!E$87,[3]!Verguetung,1+1,0)","v":0},{"$f":"VLOOKUP(Datenausgabe!F$87,[3]!Verguetung,1+1,0)","v":0},{"$f":"VLOOKUP(Datenausgabe!G$87,[3]!Verguetung,1+1,0)","v":0},{"$f":"VLOOKUP(Datenausgabe!H$87,[3]!Verguetung,1+1,0)","v":0},{"$f":"VLOOKUP(Datenausgabe!I$87,[3]!Verguetung,1+1,0)","v":0},{"$f":"VLOOKUP(Datenausgabe!J$87,[3]!Verguetung,1+1,0)","v":0},{"$f":"VLOOKUP(Datenausgabe!K$87,[3]!Verguetung,1+1,0)","v":0},{"$f":"VLOOKUP(Datenausgabe!L$87,[3]!Verguetung,1+1,0)","v":0},{"$f":"VLOOKUP(Datenausgabe!M$87,[3]!Verguetung,1+1,0)","v":0}]
["Neue Entgelttgruppe Stufe 2",{"$f":"VLOOKUP(Datenausgabe!B$87,[2]!Verguetung,2+1,0)","v":5943.83},{"$f":"VLOOKUP(Datenausgabe!C$87,[2]!Verguetung,2+1,0)","v":5943.83},{"$f":"VLOOKUP(Datenausgabe!D$87,[3]!Verguetung,2+1,0)","v":6006.83},{"$f":"VLOOKUP(Datenausgabe!E$87,[3]!Verguetung,2+1,0)","v":6006.83},{"$f":"VLOOKUP(Datenausgabe!F$87,[3]!Verguetung,2+1,0)","v":6006.83},{"$f":"VLOOKUP(Datenausgabe!G$87,[3]!Verguetung,2+1,0)","v":6006.83},{"$f":"VLOOKUP(Datenausgabe!H$87,[3]!Verguetung,2+1,0)","v":6006.83},{"$f":"VLOOKUP(Datenausgabe!I$87,[3]!Verguetung,2+1,0)","v":6006.83},{"$f":"VLOOKUP(Datenausgabe!J$87,[3]!Verguetung,2+1,0)","v":6006.83},{"$f":"VLOOKUP(Datenausgabe!K$87,[3]!Verguetung,2+1,0)","v":6006.83},{"$f":"VLOOKUP(Datenausgabe!L$87,[3]!Verguetung,2+1,0)","v":6006.83},{"$f":"VLOOKUP(Datenausgabe!M$87,[3]!Verguetung,2+1,0)","v":6006.83}]
["Neue Entgelttgruppe Stufe 3",{"$f":"VLOOKUP(Datenausgabe!B$87,[2]!Verguetung,3+1,0)","v":6588.41},{"$f":"VLOOKUP(Datenausgabe!C$87,[2]!Verguetung,3+1,0)","v":6588.41},{"$f":"VLOOKUP(Datenausgabe!D$87,[3]!Verguetung,3+1,0)","v":6658.25},{"$f":"VLOOKUP(Datenausgabe!E$87,[3]!Verguetung,3+1,0)","v":6658.25},{"$f":"VLOOKUP(Datenausgabe!F$87,[3]!Verguetung,3+1,0)","v":6658.25},{"$f":"VLOOKUP(Datenausgabe!G$87,[3]!Verguetung,3+1,0)","v":6658.25},{"$f":"VLOOKUP(Datenausgabe!H$87,[3]!Verguetung,3+1,0)","v":6658.25},{"$f":"VLOOKUP(Datenausgabe!I$87,[3]!Verguetung,3+1,0)","v":6658.25},{"$f":"VLOOKUP(Datenausgabe!J$87,[3]!Verguetung,3+1,0)","v":6658.25},{"$f":"VLOOKUP(Datenausgabe!K$87,[3]!Verguetung,3+1,0)","v":6658.25},{"$f":"VLOOKUP(Datenausgabe!L$87,[3]!Verguetung,3+1,0)","v":6658.25},{"$f":"VLOOKUP(Datenausgabe!M$87,[3]!Verguetung,3+1,0)","v":6658.25}]
["Neue Entgelttgruppe Stufe 4",{"$f":"VLOOKUP(Datenausgabe!B$87,[2]!Verguetung,4+1,0)","v":7199.08},{"$f":"VLOOKUP(Datenausgabe!C$87,[2]!Verguetung,4+1,0)","v":7199.08},{"$f":"VLOOKUP(Datenausgabe!D$87,[3]!Verguetung,4+1,0)","v":7275.39},{"$f":"VLOOKUP(Datenausgabe!E$87,[3]!Verguetung,4+1,0)","v":7275.39},{"$f":"VLOOKUP(Datenausgabe!F$87,[3]!Verguetung,4+1,0)","v":7275.39},{"$f":"VLOOKUP(Datenausgabe!G$87,[3]!Verguetung,4+1,0)","v":7275.39},{"$f":"VLOOKUP(Datenausgabe!H$87,[3]!Verguetung,4+1,0)","v":7275.39},{"$f":"VLOOKUP(Datenausgabe!I$87,[3]!Verguetung,4+1,0)","v":7275.39},{"$f":"VLOOKUP(Datenausgabe!J$87,[3]!Verguetung,4+1,0)","v":7275.39},{"$f":"VLOOKUP(Datenausgabe!K$87,[3]!Verguetung,4+1,0)","v":7275.39},{"$f":"VLOOKUP(Datenausgabe!L$87,[3]!Verguetung,4+1,0)","v":7275.39},{"$f":"VLOOKUP(Datenausgabe!M$87,[3]!Verguetung,4+1,0)","v":7275.39}]
["Neue Entgelttgruppe Stufe 5",{"$f":"VLOOKUP(Datenausgabe!B$87,[2]!Verguetung,5+1,0)","v":7606.22},{"$f":"VLOOKUP(Datenausgabe!C$87,[2]!Verguetung,5+1,0)","v":7606.22},{"$f":"VLOOKUP(Datenausgabe!D$87,[3]!Verguetung,5+1,0)","v":7686.85},{"$f":"VLOOKUP(Datenausgabe!E$87,[3]!Verguetung,5+1,0)","v":7686.85},{"$f":"VLOOKUP(Datenausgabe!F$87,[3]!Verguetung,5+1,0)","v":7686.85},{"$f":"VLOOKUP(Datenausgabe!G$87,[3]!Verguetung,5+1,0)","v":7686.85},{"$f":"VLOOKUP(Datenausgabe!H$87,[3]!Verguetung,5+1,0)","v":7686.85},{"$f":"VLOOKUP(Datenausgabe!I$87,[3]!Verguetung,5+1,0)","v":7686.85},{"$f":"VLOOKUP(Datenausgabe!J$87,[3]!Verguetung,5+1,0)","v":7686.85},{"$f":"VLOOKUP(Datenausgabe!K$87,[3]!Verguetung,5+1,0)","v":7686.85},{"$f":"VLOOKUP(Datenausgabe!L$87,[3]!Verguetung,5+1,0)","v":7686.85},{"$f":"VLOOKUP(Datenausgabe!M$87,[3]!Verguetung,5+1,0)","v":7686.85}]
["Neue Entgelttgruppe Stufe 6",{"$f":"VLOOKUP(Datenausgabe!B$87,[2]!Verguetung,6+1,0)","v":7701.19},{"$f":"VLOOKUP(Datenausgabe!C$87,[2]!Verguetung,6+1,0)","v":7701.19},{"$f":"VLOOKUP(Datenausgabe!D$87,[3]!Verguetung,6+1,0)","v":7782.82},{"$f":"VLOOKUP(Datenausgabe!E$87,[3]!Verguetung,6+1,0)","v":7782.82},{"$f":"VLOOKUP(Datenausgabe!F$87,[3]!Verguetung,6+1,0)","v":7782.82},{"$f":"VLOOKUP(Datenausgabe!G$87,[3]!Verguetung,6+1,0)","v":7782.82},{"$f":"VLOOKUP(Datenausgabe!H$87,[3]!Verguetung,6+1,0)","v":7782.82},{"$f":"VLOOKUP(Datenausgabe!I$87,[3]!Verguetung,6+1,0)","v":7782.82},{"$f":"VLOOKUP(Datenausgabe!J$87,[3]!Verguetung,6+1,0)","v":7782.82},{"$f":"VLOOKUP(Datenausgabe!K$87,[3]!Verguetung,6+1,0)","v":7782.82},{"$f":"VLOOKUP(Datenausgabe!L$87,[3]!Verguetung,6+1,0)","v":7782.82},{"$f":"VLOOKUP(Datenausgabe!M$87,[3]!Verguetung,6+1,0)","v":7782.82}]
[]
["Stufe Neu",{"$f":"IF(B237<>\"\",IF(IF(NaechsteStufe(B238,B240:B245)>Datenausgabe!B89,Datenausgabe!B89,NaechsteStufe(B238,B240:B245))<2,2,IF(NaechsteStufe(B238,B240:B245)>Datenausgabe!B89,Datenausgabe!B89,NaechsteStufe(B238,B240:B245))),0)","v":0},{"$f":"IF(C237<>\"\",IF(NaechsteStufe(C238,C240:C245)>Datenausgabe!C89,Datenausgabe!C89,NaechsteStufe(C238,C240:C245)),0)","v":0},{"$f":"IF(D237<>\"\",IF(NaechsteStufe(D238,D240:D245)>Datenausgabe!D89,Datenausgabe!D89,NaechsteStufe(D238,D240:D245)),0)","v":0},{"$f":"IF(E237<>\"\",IF(NaechsteStufe(E238,E240:E245)>Datenausgabe!E89,Datenausgabe!E89,NaechsteStufe(E238,E240:E245)),0)","v":0},{"$f":"IF(F237<>\"\",IF(NaechsteStufe(F238,F240:F245)>Datenausgabe!F89,Datenausgabe!F89,NaechsteStufe(F238,F240:F245)),0)","v":0},{"$f":"IF(G237<>\"\",IF(NaechsteStufe(G238,G240:G245)>Datenausgabe!G89,Datenausgabe!G89,NaechsteStufe(G238,G240:G245)),0)","v":0},{"$f":"IF(H237<>\"\",IF(NaechsteStufe(H238,H240:H245)>Datenausgabe!H89,Datenausgabe!H89,NaechsteStufe(H238,H240:H245)),0)","v":0},{"$f":"IF(I237<>\"\",IF(NaechsteStufe(I238,I240:I245)>Datenausgabe!I89,Datenausgabe!I89,NaechsteStufe(I238,I240:I245)),0)","v":0},{"$f":"IF(J237<>\"\",IF(NaechsteStufe(J238,J240:J245)>Datenausgabe!J89,Datenausgabe!J89,NaechsteStufe(J238,J240:J245)),0)","v":0},{"$f":"IF(K237<>\"\",IF(NaechsteStufe(K238,K240:K245)>Datenausgabe!K89,Datenausgabe!K89,NaechsteStufe(K238,K240:K245)),0)","v":0},{"$f":"IF(L237<>\"\",IF(NaechsteStufe(L238,L240:L245)>Datenausgabe!L89,Datenausgabe!L89,NaechsteStufe(L238,L240:L245)),0)","v":0},{"$f":"IF(M237<>\"\",IF(NaechsteStufe(M238,M240:M245)>Datenausgabe!M89,Datenausgabe!M89,NaechsteStufe(M238,M240:M245)),0)","v":0}]
["Betrag Neu:",{"$f":"IF(B237<>\"\",VLOOKUP(Datenausgabe!B$87,[2]!Verguetung,B247+1,0),0)","v":0},{"$f":"IF(C237<>\"\",VLOOKUP(Datenausgabe!C$87,[2]!Verguetung,C247+1,0),0)","v":0},{"$f":"IF(D237<>\"\",VLOOKUP(Datenausgabe!D$87,[3]!Verguetung,D247+1,0),0)","v":0},{"$f":"IF(E237<>\"\",VLOOKUP(Datenausgabe!E$87,[3]!Verguetung,E247+1,0),0)","v":0},{"$f":"IF(F237<>\"\",VLOOKUP(Datenausgabe!F$87,[3]!Verguetung,F247+1,0),0)","v":0},{"$f":"IF(G237<>\"\",VLOOKUP(Datenausgabe!G$87,[3]!Verguetung,G247+1,0),0)","v":0},{"$f":"IF(H237<>\"\",VLOOKUP(Datenausgabe!H$87,[3]!Verguetung,H247+1,0),0)","v":0},{"$f":"IF(I237<>\"\",VLOOKUP(Datenausgabe!I$87,[3]!Verguetung,I247+1,0),0)","v":0},{"$f":"IF(J237<>\"\",VLOOKUP(Datenausgabe!J$87,[3]!Verguetung,J247+1,0),0)","v":0},{"$f":"IF(K237<>\"\",VLOOKUP(Datenausgabe!K$87,[3]!Verguetung,K247+1,0),0)","v":0},{"$f":"IF(L237<>\"\",VLOOKUP(Datenausgabe!L$87,[3]!Verguetung,L247+1,0),0)","v":0},{"$f":"IF(M237<>\"\",VLOOKUP(Datenausgabe!M$87,[3]!Verguetung,M247+1,0),0)","v":0}]
["Differenz ALT - NEU",{"$f":"B248-B238","v":0},{"$f":"C248-C238","v":0},0,0,0,0,0,0,0,0,0,0]
["Garantiebetrag Ergebnis:",{"$f":"IF(B249<B239,B239-B249,0)","v":0},{"$f":"IF(C249<C239,C239-C249,0)","v":0},{"$f":"IF(D249<D239,D239-D249,0)","v":0},0,0,0,0,0,0,0,0,0]
[]
["VBL Steuer"]
["ZV Umlage",{"$f":"Arbeitgeberkosten!F46","v":0},{"$f":"Arbeitgeberkosten!G46","v":0},{"$f":"Arbeitgeberkosten!H46","v":0},{"$f":"Arbeitgeberkosten!I46","v":0},{"$f":"Arbeitgeberkosten!J46","v":0},{"$f":"Arbeitgeberkosten!K46","v":0},{"$f":"Arbeitgeberkosten!L46","v":0},{"$f":"Arbeitgeberkosten!M46","v":0},{"$f":"Arbeitgeberkosten!N46","v":0},{"$f":"Arbeitgeberkosten!O46","v":0},{"$f":"Arbeitgeberkosten!P46","v":0},{"$f":"Arbeitgeberkosten!Q46","v":0}]
["Frei nach §3 Nr. 56 EStG",{"$f":"Datenausgabe!B134*Datenausgabe!B165/100","v":138},{"$f":"Datenausgabe!C134*Datenausgabe!C165/100","v":138},{"$f":"Datenausgabe!D134*Datenausgabe!D165/100","v":138},{"$f":"Datenausgabe!E134*Datenausgabe!E165/100","v":138},{"$f":"Datenausgabe!F134*Datenausgabe!F165/100","v":138},{"$f":"Datenausgabe!G134*Datenausgabe!G165/100","v":138},{"$f":"Datenausgabe!H134*Datenausgabe!H165/100","v":138},{"$f":"Datenausgabe!I134*Datenausgabe!I165/100","v":138},{"$f":"Datenausgabe!J134*Datenausgabe!J165/100","v":138},{"$f":"Datenausgabe!K134*Datenausgabe!K165/100","v":138},{"$f":"Datenausgabe!L134*Datenausgabe!L165/100","v":138},{"$f":"Datenausgabe!M134*Datenausgabe!M165/100","v":138}]
["Pausch. Grenze",{"$f":"Datenausgabe!B161","v":89.48},{"$f":"Datenausgabe!C161","v":89.48},{"$f":"Datenausgabe!D161","v":89.48},{"$f":"Datenausgabe!E161","v":89.48},{"$f":"Datenausgabe!F161","v":89.48},{"$f":"Datenausgabe!G161","v":89.48},{"$f":"Datenausgabe!H161","v":89.48},{"$f":"Datenausgabe!I161","v":89.48},{"$f":"Datenausgabe!J161","v":89.48},{"$f":"Datenausgabe!K161","v":89.48},{"$f":"Datenausgabe!L161","v":89.48},{"$f":"Datenausgabe!M161","v":89.48}]
["Steuerfrei",{"$f":"IF(B253<B254,B253,B254)","v":0},{"$f":"IF(C253<C254,C253,C254)","v":0},0,0,0,0,0,0,0,0,0,0]
["Pauschal zu versteuern",{"$f":"IF(B253<B254,0,IF(B253-B254>B255,B255,B253-B254))","v":0},{"$f":"IF(C253<C254,0,IF(C253-C254>C255,C255,C253-C254))","v":0},0,0,0,0,0,0,0,0,0,0]
["Indiv. Stpfl.",{"$f":"B253-B256-B257","v":0},{"$f":"C253-C256-C257","v":0},0,0,0,0,0,0,0,0,0,0]
[]
["VBL SV"]
["Steuerfreie Umlage:",{"$f":"IF(B256>0,B256,0)","v":0},{"$f":"IF(C256>0,C256,0)","v":0},0,0,0,0,0,0,0,0,0,0]
["Pauschal versteuert:",{"$f":"IF(B257>0,B257,0)","v":0},{"$f":"IF(C257>0,C257,0)","v":0},0,0,0,0,0,0,0,0,0,0]
["abzgl. Grenzbetrag:",{"$f":"Datenausgabe!B166","v":100},{"$f":"Datenausgabe!C166","v":100},{"$f":"Datenausgabe!D166","v":100},{"$f":"Datenausgabe!E166","v":100},{"$f":"Datenausgabe!F166","v":100},{"$f":"Datenausgabe!G166","v":100},{"$f":"Datenausgabe!H166","v":100},{"$f":"Datenausgabe!I166","v":100},{"$f":"Datenausgabe!J166","v":100},{"$f":"Datenausgabe!K166","v":100},{"$f":"Datenausgabe!L166","v":100},{"$f":"Datenausgabe!M166","v":100}]
["Hinzur. Betrag §1 I S. 4 SvEV",{"$f":"IF(B261+B262>B263,B261+B262-B263,0)","v":0},{"$f":"IF(C261+C262>C263,C261+C262-C263,0)","v":0},0,0,0,0,0,0,0,0,0,0]
["genutzter Grenzbetrag:",{"$f":"IF(B261+B262>B263,B263,B261+B262)","v":0},{"$f":"IF(C261+C262>C263,C263,C261+C262)","v":0},0,0,0,0,0,0,0,0,0,0]
[{"$f":"Datenausgabe!A158","v":"UmlagesAGProzent"},{"$f":"Datenausgabe!B158","v":5.6},{"$f":"Datenausgabe!C158","v":5.6},{"$f":"Datenausgabe!D158","v":5.6},{"$f":"Datenausgabe!E158","v":5.6},{"$f":"Datenausgabe!F158","v":5.6},{"$f":"Datenausgabe!G158","v":5.6},{"$f":"Datenausgabe!H158","v":5.6},{"$f":"Datenausgabe!I158","v":5.6},{"$f":"Datenausgabe!J158","v":5.6},{"$f":"Datenausgabe!K158","v":5.6},{"$f":"Datenausgabe!L158","v":5.6},{"$f":"Datenausgabe!M158","v":5.6}]
[{"$f":"Datenausgabe!A160","v":"HinzurProzent"},{"$f":"Datenausgabe!B160","v":2.5},{"$f":"Datenausgabe!C160","v":2.5},{"$f":"Datenausgabe!D160","v":2.5},{"$f":"Datenausgabe!E160","v":2.5},{"$f":"Datenausgabe!F160","v":2.5},{"$f":"Datenausgabe!G160","v":2.5},{"$f":"Datenausgabe!H160","v":2.5},{"$f":"Datenausgabe!I160","v":2.5},{"$f":"Datenausgabe!J160","v":2.5},{"$f":"Datenausgabe!K160","v":2.5},{"$f":"Datenausgabe!L160","v":2.5},{"$f":"Datenausgabe!M160","v":2.5}]
[{"$f":"Datenausgabe!A162","v":"PauschFreibetrag"},{"$f":"Datenausgabe!B162","v":13.3},{"$f":"Datenausgabe!C162","v":13.3},{"$f":"Datenausgabe!D162","v":13.3},{"$f":"Datenausgabe!E162","v":13.3},{"$f":"Datenausgabe!F162","v":13.3},{"$f":"Datenausgabe!G162","v":13.3},{"$f":"Datenausgabe!H162","v":13.3},{"$f":"Datenausgabe!I162","v":13.3},{"$f":"Datenausgabe!J162","v":13.3},{"$f":"Datenausgabe!K162","v":13.3},{"$f":"Datenausgabe!L162","v":13.3},{"$f":"Datenausgabe!M162","v":13.3}]
["Hinzur. Betrag §1 I S. 3 SvEV",{"$f":"B265/B266*100*B267/100-B268","v":-13.3},{"$f":"C265/C266*100*C267/100-C268","v":-13.3},-13.3,-13.3,-13.3,-13.3,-13.3,-13.3,-13.3,-13.3,-13.3,-13.3]
[]
[]
["KZVK Steuer",{"$f":"12*Datenausgabe!B134*Datenausgabe!B163/100*2","v":6624},"Steuerfrei im Jahr"]
["ZV Umlage",{"$f":"Arbeitgeberkosten!F46+'Nettoberechnung Jahr'!F54","v":0},{"$f":"Arbeitgeberkosten!G46+'Nettoberechnung Jahr'!G54","v":0},{"$f":"Arbeitgeberkosten!H46+'Nettoberechnung Jahr'!H54","v":0},{"$f":"Arbeitgeberkosten!I46+'Nettoberechnung Jahr'!I54","v":0},{"$f":"Arbeitgeberkosten!J46+'Nettoberechnung Jahr'!J54","v":0},{"$f":"Arbeitgeberkosten!K46+'Nettoberechnung Jahr'!K54","v":0},{"$f":"Arbeitgeberkosten!L46+'Nettoberechnung Jahr'!L54","v":0},{"$f":"Arbeitgeberkosten!M46+'Nettoberechnung Jahr'!M54","v":0},{"$f":"Arbeitgeberkosten!N46+'Nettoberechnung Jahr'!N54","v":0},{"$f":"Arbeitgeberkosten!O46+'Nettoberechnung Jahr'!O54","v":0},{"$f":"Arbeitgeberkosten!P46+'Nettoberechnung Jahr'!P54","v":0},{"$f":"Arbeitgeberkosten!Q46+'Nettoberechnung Jahr'!Q54","v":0}]
["Steuerpfl",{"$f":"IF(SUM($B$273:B273)-$B$272>0,SUM($B$273:B273)-$B$272,0)","v":0},{"$f":"IF(SUM($B$273:C273)-$B$272>0,SUM($B$273:C273)-$B$272,0)","v":0},{"$f":"IF(SUM($B$273:D273)-$B$272>0,SUM($B$273:D273)-$B$272,0)","v":0},{"$f":"IF(SUM($B$273:E273)-$B$272>0,SUM($B$273:E273)-$B$272,0)","v":0},{"$f":"IF(SUM($B$273:F273)-$B$272>0,SUM($B$273:F273)-$B$272,0)","v":0},{"$f":"IF(SUM($B$273:G273)-$B$272>0,SUM($B$273:G273)-$B$272,0)","v":0},{"$f":"IF(SUM($B$273:H273)-$B$272>0,SUM($B$273:H273)-$B$272,0)","v":0},{"$f":"IF(SUM($B$273:I273)-$B$272>0,SUM($B$273:I273)-$B$272,0)","v":0},{"$f":"IF(SUM($B$273:J273)-$B$272>0,SUM($B$273:J273)-$B$272,0)","v":0},{"$f":"IF(SUM($B$273:K273)-$B$272>0,SUM($B$273:K273)-$B$272,0)","v":0},{"$f":"IF(SUM($B$273:L273)-$B$272>0,SUM($B$273:L273)-$B$272,0)","v":0},{"$f":"IF(SUM($B$273:M273)-$B$272>0,SUM($B$273:M273)-$B$272,0)","v":0}]
["Frei nach §3 Nr. 56 EStG",{"$f":"B273-B274","v":0},{"$f":"C273-C274","v":0},0,0,0,0,0,0,0,0,0,0,{"$f":"SUM(B275:M275)","v":0}]
["Pausch. Grenze",{"$f":"Datenausgabe!B161","v":89.48},{"$f":"Datenausgabe!C161","v":89.48},{"$f":"Datenausgabe!D161","v":89.48},{"$f":"Datenausgabe!E161","v":89.48},{"$f":"Datenausgabe!F161","v":89.48},{"$f":"Datenausgabe!G161","v":89.48},{"$f":"Datenausgabe!H161","v":89.48},{"$f":"Datenausgabe!I161","v":89.48},{"$f":"Datenausgabe!J161","v":89.48},{"$f":"Datenausgabe!K161","v":89.48},{"$f":"Datenausgabe!L161","v":89.48},{"$f":"Datenausgabe!M161","v":89.48}]
["Steuerfrei",{"$f":"IF(B273<B275,B273,B275)","v":0},0,0,0,0,0,0,0,0,0,0,0]
["max.1752",1752,{"$f":"B278-B279","v":1752},{"$f":"C278-C279","v":1752},1752,1752,1752,1752,1752,1752,1752,1752,1752]
["Pauschal zu versteuern",{"$f":"IF(B278>B274,B274,B278)","v":0},{"$f":"IF(C278>C274,C274,C278)","v":0},0,0,0,0,0,0,0,0,0,0,1752]
["Indiv. Stpfl.",{"$f":"B273-B275-B279","v":0},{"$f":"C273-C275-C279","v":0},0,0,0,0,0,0,0,0,0,0]
[]
[]
[]
["KZVK SV"]
["Steuerfreie Umlage:",{"$f":"B277","v":0},{"$f":"C277","v":0},0,0,0,0,0,0,0,0,0,0]
["Pauschal versteuert:",{"$f":"B279","v":0},{"$f":"C279","v":0},0,0,0,0,0,0,0,0,0,0]
["abzgl. Grenzbetrag:",{"$f":"Datenausgabe!B166","v":100},{"$f":"Datenausgabe!C166","v":100},{"$f":"Datenausgabe!D166","v":100},{"$f":"Datenausgabe!E166","v":100},{"$f":"Datenausgabe!F166","v":100},{"$f":"Datenausgabe!G166","v":100},{"$f":"Datenausgabe!H166","v":100},{"$f":"Datenausgabe!I166","v":100},{"$f":"Datenausgabe!J166","v":100},{"$f":"Datenausgabe!K166","v":100},{"$f":"Datenausgabe!L166","v":100},{"$f":"Datenausgabe!M166","v":100}]
["Hinzur. Betrag §1 I S. 4 SvEV",{"$f":"IF(B286>B287,B286-B287,0)","v":0},{"$f":"IF(C286>C287,C286-C287,0)","v":0},0,0,0,0,0,0,0,0,0,0]
["genutzter Grenzbetrag:",{"$f":"IF(B286>B287,B287,B286)","v":0},{"$f":"IF(C286>C287,C287,C286)","v":0},0,0,0,0,0,0,0,0,0,0]
[{"$f":"Datenausgabe!A158","v":"UmlagesAGProzent"},{"$f":"Datenausgabe!B158","v":5.6},{"$f":"Datenausgabe!C158","v":5.6},{"$f":"Datenausgabe!D158","v":5.6},{"$f":"Datenausgabe!E158","v":5.6},{"$f":"Datenausgabe!F158","v":5.6},{"$f":"Datenausgabe!G158","v":5.6},{"$f":"Datenausgabe!H158","v":5.6},{"$f":"Datenausgabe!I158","v":5.6},{"$f":"Datenausgabe!J158","v":5.6},{"$f":"Datenausgabe!K158","v":5.6},{"$f":"Datenausgabe!L158","v":5.6},{"$f":"Datenausgabe!M158","v":5.6}]
[{"$f":"Datenausgabe!A160","v":"HinzurProzent"},{"$f":"Datenausgabe!B160","v":2.5},{"$f":"Datenausgabe!C160","v":2.5},{"$f":"Datenausgabe!D160","v":2.5},{"$f":"Datenausgabe!E160","v":2.5},{"$f":"Datenausgabe!F160","v":2.5},{"$f":"Datenausgabe!G160","v":2.5},{"$f":"Datenausgabe!H160","v":2.5},{"$f":"Datenausgabe!I160","v":2.5},{"$f":"Datenausgabe!J160","v":2.5},{"$f":"Datenausgabe!K160","v":2.5},{"$f":"Datenausgabe!L160","v":2.5},{"$f":"Datenausgabe!M160","v":2.5}]
[{"$f":"Datenausgabe!A162","v":"PauschFreibetrag"},{"$f":"Datenausgabe!B162","v":13.3},{"$f":"Datenausgabe!C162","v":13.3},{"$f":"Datenausgabe!D162","v":13.3},{"$f":"Datenausgabe!E162","v":13.3},{"$f":"Datenausgabe!F162","v":13.3},{"$f":"Datenausgabe!G162","v":13.3},{"$f":"Datenausgabe!H162","v":13.3},{"$f":"Datenausgabe!I162","v":13.3},{"$f":"Datenausgabe!J162","v":13.3},{"$f":"Datenausgabe!K162","v":13.3},{"$f":"Datenausgabe!L162","v":13.3},{"$f":"Datenausgabe!M162","v":13.3}]
["Hinzur. Betrag §1 I S. 3 SvEV",{"$f":"IF(B289/B290*100*B291/100-B292<0,0,B289/B290*100*B291/100-B292)","v":0},{"$f":"IF(C289/C290*100*C291/100-C292<0,0,C289/C290*100*C291/100-C292)","v":0},0,0,0,0,0,0,0,0,0,0]
[]
["Kranken / Pflegevers","(bei normaler SV Pflicht)"]
["Art",{"$f":"Datenausgabe!B146","v":1},{"$f":"Datenausgabe!C146","v":1},{"$f":"Datenausgabe!D146","v":1},{"$f":"Datenausgabe!E146","v":1},{"$f":"Datenausgabe!F146","v":1},{"$f":"Datenausgabe!G146","v":1},{"$f":"Datenausgabe!H146","v":1},{"$f":"Datenausgabe!I146","v":1},{"$f":"Datenausgabe!J146","v":1},{"$f":"Datenausgabe!K146","v":1},{"$f":"Datenausgabe!L146","v":1},{"$f":"Datenausgabe!M146","v":1}]
["KV","0 - frei / privat, 1 - pflichtig, 2 - freiwillig, 3 - privat mit Zuschuss\n"]
["AG",{"$f":"IF(B296>0,ROUND(Arbeitgeberkosten!F29*(Datenausgabe!B138+(Datenausgabe!B142/2))/100,2),0)","v":0.52},{"$f":"IF(C296>0,ROUND(Arbeitgeberkosten!G29*(Datenausgabe!C138+(Datenausgabe!C142/2))/100,2),0)","v":0.52},{"$f":"IF(D296>0,ROUND(Arbeitgeberkosten!H29*(Datenausgabe!D138+(Datenausgabe!D142/2))/100,2),0)","v":0.52},{"$f":"IF(E296>0,ROUND(Arbeitgeberkosten!I29*(Datenausgabe!E138+(Datenausgabe!E142/2))/100,2),0)","v":0.52},{"$f":"IF(F296>0,ROUND(Arbeitgeberkosten!J29*(Datenausgabe!F138+(Datenausgabe!F142/2))/100,2),0)","v":0.52},{"$f":"IF(G296>0,ROUND(Arbeitgeberkosten!K29*(Datenausgabe!G138+(Datenausgabe!G142/2))/100,2),0)","v":0.52},{"$f":"IF(H296>0,ROUND(Arbeitgeberkosten!L29*(Datenausgabe!H138+(Datenausgabe!H142/2))/100,2),0)","v":0.52},{"$f":"IF(I296>0,ROUND(Arbeitgeberkosten!M29*(Datenausgabe!I138+(Datenausgabe!I142/2))/100,2),0)","v":0.52},{"$f":"IF(J296>0,ROUND(Arbeitgeberkosten!N29*(Datenausgabe!J138+(Datenausgabe!J142/2))/100,2),0)","v":0.52},{"$f":"IF(K296>0,ROUND(Arbeitgeberkosten!O29*(Datenausgabe!K138+(Datenausgabe!K142/2))/100,2),0)","v":0.52},{"$f":"IF(L296>0,ROUND(Arbeitgeberkosten!P29*(Datenausgabe!L138+(Datenausgabe!L142/2))/100,2),0)","v":0.52},{"$f":"IF(M296>0,ROUND(Arbeitgeberkosten!Q29*(Datenausgabe!M138+(Datenausgabe!M142/2))/100,2),0)","v":0.52}]
["AG EGA",{"$f":"IF(B296>0,ROUND(Arbeitgeberkosten!F31*(Datenausgabe!B138+(Datenausgabe!B142/2))/100,2),0)","v":0},{"$f":"IF(C296>0,ROUND(Arbeitgeberkosten!G31*(Datenausgabe!C138+(Datenausgabe!C142/2))/100,2),0)","v":0},{"$f":"IF(D296>0,ROUND(Arbeitgeberkosten!H31*(Datenausgabe!D138+(Datenausgabe!D142/2))/100,2),0)","v":0},{"$f":"IF(E296>0,ROUND(Arbeitgeberkosten!I31*(Datenausgabe!E138+(Datenausgabe!E142/2))/100,2),0)","v":0},{"$f":"IF(F296>0,ROUND(Arbeitgeberkosten!J31*(Datenausgabe!F138+(Datenausgabe!F142/2))/100,2),0)","v":0},{"$f":"IF(G296>0,ROUND(Arbeitgeberkosten!K31*(Datenausgabe!G138+(Datenausgabe!G142/2))/100,2),0)","v":0},{"$f":"IF(H296>0,ROUND(Arbeitgeberkosten!L31*(Datenausgabe!H138+(Datenausgabe!H142/2))/100,2),0)","v":0},{"$f":"IF(I296>0,ROUND(Arbeitgeberkosten!M31*(Datenausgabe!I138+(Datenausgabe!I142/2))/100,2),0)","v":0},{"$f":"IF(J296>0,ROUND(Arbeitgeberkosten!N31*(Datenausgabe!J138+(Datenausgabe!J142/2))/100,2),0)","v":0},{"$f":"IF(K296>0,ROUND(Arbeitgeberkosten!O31*(Datenausgabe!K138+(Datenausgabe!K142/2))/100,2),0)","v":0},{"$f":"IF(L296>0,ROUND(Arbeitgeberkosten!P31*(Datenausgabe!L138+(Datenausgabe!L142/2))/100,2),0)","v":0},{"$f":"IF(M296>0,ROUND(Arbeitgeberkosten!Q31*(Datenausgabe!M138+(Datenausgabe!M142/2))/100,2),0)","v":0}]
["AN",{"$f":"IF(B296>0,ROUND('Nettoberechnung Jahr'!F29*(Datenausgabe!B138+(Datenausgabe!B142/2))/100,2),0)","v":0.52},{"$f":"IF(C296>0,ROUND('Nettoberechnung Jahr'!G29*(Datenausgabe!C138+(Datenausgabe!C142/2))/100,2),0)","v":0.52},{"$f":"IF(D296>0,ROUND('Nettoberechnung Jahr'!H29*(Datenausgabe!D138+(Datenausgabe!D142/2))/100,2),0)","v":0.52},{"$f":"IF(E296>0,ROUND('Nettoberechnung Jahr'!I29*(Datenausgabe!E138+(Datenausgabe!E142/2))/100,2),0)","v":0.52},{"$f":"IF(F296>0,ROUND('Nettoberechnung Jahr'!J29*(Datenausgabe!F138+(Datenausgabe!F142/2))/100,2),0)","v":0.52},{"$f":"IF(G296>0,ROUND('Nettoberechnung Jahr'!K29*(Datenausgabe!G138+(Datenausgabe!G142/2))/100,2),0)","v":0.52},{"$f":"IF(H296>0,ROUND('Nettoberechnung Jahr'!L29*(Datenausgabe!H138+(Datenausgabe!H142/2))/100,2),0)","v":0.52},{"$f":"IF(I296>0,ROUND('Nettoberechnung Jahr'!M29*(Datenausgabe!I138+(Datenausgabe!I142/2))/100,2),0)","v":0.52},{"$f":"IF(J296>0,ROUND('Nettoberechnung Jahr'!N29*(Datenausgabe!J138+(Datenausgabe!J142/2))/100,2),0)","v":0.52},{"$f":"IF(K296>0,ROUND('Nettoberechnung Jahr'!O29*(Datenausgabe!K138+(Datenausgabe!K142/2))/100,2),0)","v":0.52},{"$f":"IF(L296>0,ROUND('Nettoberechnung Jahr'!P29*(Datenausgabe!L138+(Datenausgabe!L142/2))/100,2),0)","v":0.52},{"$f":"IF(M296>0,ROUND('Nettoberechnung Jahr'!Q29*(Datenausgabe!M138+(Datenausgabe!M142/2))/100,2),0)","v":0.52}]
["AN EGA",{"$f":"IF(B296>0,ROUND('Nettoberechnung Jahr'!F31*(Datenausgabe!B138+Datenausgabe!B142)/100,2),0)","v":0},{"$f":"IF(C296>0,ROUND('Nettoberechnung Jahr'!G31*(Datenausgabe!C138+Datenausgabe!C142)/100,2),0)","v":0},{"$f":"IF(D296>0,ROUND('Nettoberechnung Jahr'!H31*(Datenausgabe!D138+Datenausgabe!D142)/100,2),0)","v":0},{"$f":"IF(E296>0,ROUND('Nettoberechnung Jahr'!I31*(Datenausgabe!E138+Datenausgabe!E142)/100,2),0)","v":0},{"$f":"IF(F296>0,ROUND('Nettoberechnung Jahr'!J31*(Datenausgabe!F138+Datenausgabe!F142)/100,2),0)","v":0},{"$f":"IF(G296>0,ROUND('Nettoberechnung Jahr'!K31*(Datenausgabe!G138+Datenausgabe!G142)/100,2),0)","v":0},{"$f":"IF(H296>0,ROUND('Nettoberechnung Jahr'!L31*(Datenausgabe!H138+Datenausgabe!H142)/100,2),0)","v":0},{"$f":"IF(I296>0,ROUND('Nettoberechnung Jahr'!M31*(Datenausgabe!I138+Datenausgabe!I142)/100,2),0)","v":0},{"$f":"IF(J296>0,ROUND('Nettoberechnung Jahr'!N31*(Datenausgabe!J138+Datenausgabe!J142)/100,2),0)","v":0},{"$f":"IF(K296>0,ROUND('Nettoberechnung Jahr'!O31*(Datenausgabe!K138+Datenausgabe!K142)/100,2),0)","v":0},{"$f":"IF(L296>0,ROUND('Nettoberechnung Jahr'!P31*(Datenausgabe!L138+Datenausgabe!L142)/100,2),0)","v":0},{"$f":"IF(M296>0,ROUND('Nettoberechnung Jahr'!Q31*(Datenausgabe!M138+Datenausgabe!M142)/100,2),0)","v":0}]
["PV"]
["AG",{"$f":"IF(B296>0,ROUND(Arbeitgeberkosten!F29*Datenausgabe!B139/100,2),0)","v":0.1},{"$f":"IF(C296>0,ROUND(Arbeitgeberkosten!G29*Datenausgabe!C139/100,2),0)","v":0.1},{"$f":"IF(D296>0,ROUND(Arbeitgeberkosten!H29*Datenausgabe!D139/100,2),0)","v":0.1},{"$f":"IF(E296>0,ROUND(Arbeitgeberkosten!I29*Datenausgabe!E139/100,2),0)","v":0.1},{"$f":"IF(F296>0,ROUND(Arbeitgeberkosten!J29*Datenausgabe!F139/100,2),0)","v":0.1},{"$f":"IF(G296>0,ROUND(Arbeitgeberkosten!K29*Datenausgabe!G139/100,2),0)","v":0.1},{"$f":"IF(H296>0,ROUND(Arbeitgeberkosten!L29*Datenausgabe!H139/100,2),0)","v":0.1},{"$f":"IF(I296>0,ROUND(Arbeitgeberkosten!M29*Datenausgabe!I139/100,2),0)","v":0.1},{"$f":"IF(J296>0,ROUND(Arbeitgeberkosten!N29*Datenausgabe!J139/100,2),0)","v":0.1},{"$f":"IF(K296>0,ROUND(Arbeitgeberkosten!O29*Datenausgabe!K139/100,2),0)","v":0.1},{"$f":"IF(L296>0,ROUND(Arbeitgeberkosten!P29*Datenausgabe!L139/100,2),0)","v":0.1},{"$f":"IF(M296>0,ROUND(Arbeitgeberkosten!Q29*Datenausgabe!M139/100,2),0)","v":0.1}]
["AG EGA",{"$f":"IF(B296>0,ROUND(Arbeitgeberkosten!F31*Datenausgabe!B139/100,2),0)","v":0},{"$f":"IF(C296>0,ROUND(Arbeitgeberkosten!G31*Datenausgabe!C139/100,2),0)","v":0},{"$f":"IF(D296>0,ROUND(Arbeitgeberkosten!H31*Datenausgabe!D139/100,2),0)","v":0},{"$f":"IF(E296>0,ROUND(Arbeitgeberkosten!I31*Datenausgabe!E139/100,2),0)","v":0},{"$f":"IF(F296>0,ROUND(Arbeitgeberkosten!J31*Datenausgabe!F139/100,2),0)","v":0},{"$f":"IF(G296>0,ROUND(Arbeitgeberkosten!K31*Datenausgabe!G139/100,2),0)","v":0},{"$f":"IF(H296>0,ROUND(Arbeitgeberkosten!L31*Datenausgabe!H139/100,2),0)","v":0},{"$f":"IF(I296>0,ROUND(Arbeitgeberkosten!M31*Datenausgabe!I139/100,2),0)","v":0},{"$f":"IF(J296>0,ROUND(Arbeitgeberkosten!N31*Datenausgabe!J139/100,2),0)","v":0},{"$f":"IF(K296>0,ROUND(Arbeitgeberkosten!O31*Datenausgabe!K139/100,2),0)","v":0},{"$f":"IF(L296>0,ROUND(Arbeitgeberkosten!P31*Datenausgabe!L139/100,2),0)","v":0},{"$f":"IF(M296>0,ROUND(Arbeitgeberkosten!Q31*Datenausgabe!M139/100,2),0)","v":0}]
["AN",{"$f":"IF(B296>0,ROUND('Nettoberechnung Jahr'!F29*Datenausgabe!B139/100,2)+IF(Datenausgabe!B132,0,ROUND('Nettoberechnung Jahr'!F29*Datenausgabe!B143/100,2)),0)","v":0.12},{"$f":"IF(C296>0,ROUND('Nettoberechnung Jahr'!G29*Datenausgabe!C139/100,2)+IF(Datenausgabe!C132,0,ROUND('Nettoberechnung Jahr'!G29*Datenausgabe!C143/100,2)),0)","v":0.12},{"$f":"IF(D296>0,ROUND('Nettoberechnung Jahr'!H29*Datenausgabe!D139/100,2)+IF(Datenausgabe!D132,0,ROUND('Nettoberechnung Jahr'!H29*Datenausgabe!D143/100,2)),0)","v":0.12},{"$f":"IF(E296>0,ROUND('Nettoberechnung Jahr'!I29*Datenausgabe!E139/100,2)+IF(Datenausgabe!E132,0,ROUND('Nettoberechnung Jahr'!I29*Datenausgabe!E143/100,2)),0)","v":0.12},{"$f":"IF(F296>0,ROUND('Nettoberechnung Jahr'!J29*Datenausgabe!F139/100,2)+IF(Datenausgabe!F132,0,ROUND('Nettoberechnung Jahr'!J29*Datenausgabe!F143/100,2)),0)","v":0.12},{"$f":"IF(G296>0,ROUND('Nettoberechnung Jahr'!K29*Datenausgabe!G139/100,2)+IF(Datenausgabe!G132,0,ROUND('Nettoberechnung Jahr'!K29*Datenausgabe!G143/100,2)),0)","v":0.12},{"$f":"IF(H296>0,ROUND('Nettoberechnung Jahr'!L29*Datenausgabe!H139/100,2)+IF(Datenausgabe!H132,0,ROUND('Nettoberechnung Jahr'!L29*Datenausgabe!H143/100,2)),0)","v":0.12},{"$f":"IF(I296>0,ROUND('Nettoberechnung Jahr'!M29*Datenausgabe!I139/100,2)+IF(Datenausgabe!I132,0,ROUND('Nettoberechnung Jahr'!M29*Datenausgabe!I143/100,2)),0)","v":0.12},{"$f":"IF(J296>0,ROUND('Nettoberechnung Jahr'!N29*Datenausgabe!J139/100,2)+IF(Datenausgabe!J132,0,ROUND('Nettoberechnung Jahr'!N29*Datenausgabe!J143/100,2)),0)","v":0.12},{"$f":"IF(K296>0,ROUND('Nettoberechnung Jahr'!O29*Datenausgabe!K139/100,2)+IF(Datenausgabe!K132,0,ROUND('Nettoberechnung Jahr'!O29*Datenausgabe!K143/100,2)),0)","v":0.12},{"$f":"IF(L296>0,ROUND('Nettoberechnung Jahr'!P29*Datenausgabe!L139/100,2)+IF(Datenausgabe!L132,0,ROUND('Nettoberechnung Jahr'!P29*Datenausgabe!L143/100,2)),0)","v":0.12},{"$f":"IF(M296>0,ROUND('Nettoberechnung Jahr'!Q29*Datenausgabe!M139/100,2)+IF(Datenausgabe!M132,0,ROUND('Nettoberechnung Jahr'!Q29*Datenausgabe!M143/100,2)),0)","v":0.12}]
["AN EGA",{"$f":"IF(B296>0,ROUND('Nettoberechnung Jahr'!F31*Datenausgabe!B139/100,2)+IF(Datenausgabe!B132,0,ROUND('Nettoberechnung Jahr'!F31*Datenausgabe!B143/100,2)),0)","v":0},{"$f":"IF(C296>0,ROUND('Nettoberechnung Jahr'!G31*Datenausgabe!C139/100,2)+IF(Datenausgabe!C132,0,ROUND('Nettoberechnung Jahr'!G31*Datenausgabe!C143/100,2)),0)","v":0},{"$f":"IF(D296>0,ROUND('Nettoberechnung Jahr'!H31*Datenausgabe!D139/100,2)+IF(Datenausgabe!D132,0,ROUND('Nettoberechnung Jahr'!H31*Datenausgabe!D143/100,2)),0)","v":0},{"$f":"IF(E296>0,ROUND('Nettoberechnung Jahr'!I31*Datenausgabe!E139/100,2)+IF(Datenausgabe!E132,0,ROUND('Nettoberechnung Jahr'!I31*Datenausgabe!E143/100,2)),0)","v":0},{"$f":"IF(F296>0,ROUND('Nettoberechnung Jahr'!J31*Datenausgabe!F139/100,2)+IF(Datenausgabe!F132,0,ROUND('Nettoberechnung Jahr'!J31*Datenausgabe!F143/100,2)),0)","v":0},{"$f":"IF(G296>0,ROUND('Nettoberechnung Jahr'!K31*Datenausgabe!G139/100,2)+IF(Datenausgabe!G132,0,ROUND('Nettoberechnung Jahr'!K31*Datenausgabe!G143/100,2)),0)","v":0},{"$f":"IF(H296>0,ROUND('Nettoberechnung Jahr'!L31*Datenausgabe!H139/100,2)+IF(Datenausgabe!H132,0,ROUND('Nettoberechnung Jahr'!L31*Datenausgabe!H143/100,2)),0)","v":0},{"$f":"IF(I296>0,ROUND('Nettoberechnung Jahr'!M31*Datenausgabe!I139/100,2)+IF(Datenausgabe!I132,0,ROUND('Nettoberechnung Jahr'!M31*Datenausgabe!I143/100,2)),0)","v":0},{"$f":"IF(J296>0,ROUND('Nettoberechnung Jahr'!N31*Datenausgabe!J139/100,2)+IF(Datenausgabe!J132,0,ROUND('Nettoberechnung Jahr'!N31*Datenausgabe!J143/100,2)),0)","v":0},{"$f":"IF(K296>0,ROUND('Nettoberechnung Jahr'!O31*Datenausgabe!K139/100,2)+IF(Datenausgabe!K132,0,ROUND('Nettoberechnung Jahr'!O31*Datenausgabe!K143/100,2)),0)","v":0},{"$f":"IF(L296>0,ROUND('Nettoberechnung Jahr'!P31*Datenausgabe!L139/100,2)+IF(Datenausgabe!L132,0,ROUND('Nettoberechnung Jahr'!P31*Datenausgabe!L143/100,2)),0)","v":0},{"$f":"IF(M296>0,ROUND('Nettoberechnung Jahr'!Q31*Datenausgabe!M139/100,2)+IF(Datenausgabe!M132,0,ROUND('Nettoberechnung Jahr'!Q31*Datenausgabe!M143/100,2)),0)","v":0}]
[]
["Zuschuss",{"$f":"IF(B296>1,B298+B299+B303+B304,0)","v":0},{"$f":"IF(C296>1,C298+C299+C303+C304,0)","v":0},0,0,0,0,0,0,0,0,0,0]
["Abzug",{"$f":"IF(B296=2,SUM(B298:B306),0)","v":0},{"$f":"IF(C296=2,SUM(C298:C306),0)","v":0},0,0,0,0,0,0,0,0,0,0]
[]
[]
["KZVK sv-pflichtig",{"$f":"12*Datenausgabe!B134*Datenausgabe!B163/100","v":3312},"SV-Frei im Jahr"]
["AG-Umlage",{"$f":"Arbeitgeberkosten!F46","v":0},{"$f":"Arbeitgeberkosten!G46","v":0},{"$f":"Arbeitgeberkosten!H46","v":0},{"$f":"Arbeitgeberkosten!I46","v":0},{"$f":"Arbeitgeberkosten!J46","v":0},{"$f":"Arbeitgeberkosten!K46","v":0},{"$f":"Arbeitgeberkosten!L46","v":0},{"$f":"Arbeitgeberkosten!M46","v":0},{"$f":"Arbeitgeberkosten!N46","v":0},{"$f":"Arbeitgeberkosten!O46","v":0},{"$f":"Arbeitgeberkosten!P46","v":0},{"$f":"Arbeitgeberkosten!Q46","v":0},{"$f":"SUM(B313:M313)","v":0}]
["AN-Umlage",{"$f":"'Nettoberechnung Jahr'!F54","v":0},{"$f":"'Nettoberechnung Jahr'!G54","v":0},{"$f":"'Nettoberechnung Jahr'!H54","v":0},{"$f":"'Nettoberechnung Jahr'!I54","v":0},{"$f":"'Nettoberechnung Jahr'!J54","v":0},{"$f":"'Nettoberechnung Jahr'!K54","v":0},{"$f":"'Nettoberechnung Jahr'!L54","v":0},{"$f":"'Nettoberechnung Jahr'!M54","v":0},{"$f":"'Nettoberechnung Jahr'!N54","v":0},{"$f":"'Nettoberechnung Jahr'!O54","v":0},{"$f":"'Nettoberechnung Jahr'!P54","v":0},{"$f":"'Nettoberechnung Jahr'!Q54","v":0},{"$f":"SUM(B314:M314)","v":0}]
["AG-Umlage SV-pflichtig",{"$f":"IF($B$312-(SUM($B$313:B$313)+SUM($B$314:B$314))>0,0,IF(SUM($B$313:B$313)+SUM($B$314:B$314)-$B$312<B313,SUM($B$313:B$313)+SUM($B$314:B$314)-$B$312,B313))","v":0},{"$f":"IF($B$312-(SUM($B$313:C$313)+SUM($B$314:C$314))>0,0,IF(SUM($B$313:C$313)+SUM($B$314:C$314)-$B$312<C313,SUM($B$313:C$313)+SUM($B$314:C$314)-$B$312,C313))","v":0},{"$f":"IF($B$312-(SUM($B$313:D$313)+SUM($B$314:D$314))>0,0,IF(SUM($B$313:D$313)+SUM($B$314:D$314)-$B$312<D313,SUM($B$313:D$313)+SUM($B$314:D$314)-$B$312,D313))","v":0},{"$f":"IF($B$312-(SUM($B$313:E$313)+SUM($B$314:E$314))>0,0,IF(SUM($B$313:E$313)+SUM($B$314:E$314)-$B$312<E313,SUM($B$313:E$313)+SUM($B$314:E$314)-$B$312,E313))","v":0},{"$f":"IF($B$312-(SUM($B$313:F$313)+SUM($B$314:F$314))>0,0,IF(SUM($B$313:F$313)+SUM($B$314:F$314)-$B$312<F313,SUM($B$313:F$313)+SUM($B$314:F$314)-$B$312,F313))","v":0},{"$f":"IF($B$312-(SUM($B$313:G$313)+SUM($B$314:G$314))>0,0,IF(SUM($B$313:G$313)+SUM($B$314:G$314)-$B$312<G313,SUM($B$313:G$313)+SUM($B$314:G$314)-$B$312,G313))","v":0},{"$f":"IF($B$312-(SUM($B$313:H$313)+SUM($B$314:H$314))>0,0,IF(SUM($B$313:H$313)+SUM($B$314:H$314)-$B$312<H313,SUM($B$313:H$313)+SUM($B$314:H$314)-$B$312,H313))","v":0},{"$f":"IF($B$312-(SUM($B$313:I$313)+SUM($B$314:I$314))>0,0,IF(SUM($B$313:I$313)+SUM($B$314:I$314)-$B$312<I313,SUM($B$313:I$313)+SUM($B$314:I$314)-$B$312,I313))","v":0},{"$f":"IF($B$312-(SUM($B$313:J$313)+SUM($B$314:J$314))>0,0,IF(SUM($B$313:J$313)+SUM($B$314:J$314)-$B$312<J313,SUM($B$313:J$313)+SUM($B$314:J$314)-$B$312,J313))","v":0},{"$f":"IF($B$312-(SUM($B$313:K$313)+SUM($B$314:K$314))>0,0,IF(SUM($B$313:K$313)+SUM($B$314:K$314)-$B$312<K313,SUM($B$313:K$313)+SUM($B$314:K$314)-$B$312,K313))","v":0},{"$f":"IF($B$312-(SUM($B$313:L$313)+SUM($B$314:L$314))>0,0,IF(SUM($B$313:L$313)+SUM($B$314:L$314)-$B$312<L313,SUM($B$313:L$313)+SUM($B$314:L$314)-$B$312,L313))","v":0},{"$f":"IF($B$312-(SUM($B$313:M$313)+SUM($B$314:M$314))>0,0,IF(SUM($B$313:M$313)+SUM($B$314:M$314)-$B$312<M313,SUM($B$313:M$313)+SUM($B$314:M$314)-$B$312,M313))","v":0}]
["AN-Umlage SV-pflichtig",{"$f":"IF(OR(B315=0,B315<B313),0,IF(B315<B314,B314-B315,B314))","v":0},{"$f":"IF(OR(C315=0,C315<C313),0,IF(C315<C314,C314-C315,C314))","v":0},0,0,0,0,0,0,0,0,0,0]
["SV-Pflichtige Umlagen",{"$f":"B315+B316","v":0},{"$f":"C315+C316","v":0},0,0,0,0,0,0,0,0,0,0]
["bei SV-Brutto zu berücksichtigen",{"$f":"IF((IF(B316=0,-B314,0)+B315)<B331,IF(B316=0,-B314,0)+B315,B331)","v":0},0,0,0,0,0,0,0,0,0,0,0]
[]
["Nebenrechnung für ber. KZVK sv-plficht bei Überschreitung der Rentenbemessungsgrenze"]
["SV-Brutto",{"$f":"SUM(IF(MID(Arbeitgeberkosten!$E$7:$E$22,3,1)<>\"N\",Arbeitgeberkosten!F7:'Arbeitgeberkosten'!F22,0))","v":6.65},{"$f":"SUM(IF(MID(Arbeitgeberkosten!$E$7:$E$22,3,1)<>\"N\",Arbeitgeberkosten!G7:'Arbeitgeberkosten'!G22,0))","v":6.65},{"$f":"SUM(IF(MID(Arbeitgeberkosten!$E$7:$E$22,3,1)<>\"N\",Arbeitgeberkosten!H7:'Arbeitgeberkosten'!H22,0))","v":6.65},{"$f":"SUM(IF(MID(Arbeitgeberkosten!$E$7:$E$22,3,1)<>\"N\",Arbeitgeberkosten!I7:'Arbeitgeberkosten'!I22,0))","v":6.65},{"$f":"SUM(IF(MID(Arbeitgeberkosten!$E$7:$E$22,3,1)<>\"N\",Arbeitgeberkosten!J7:'Arbeitgeberkosten'!J22,0))","v":6.65},{"$f":"SUM(IF(MID(Arbeitgeberkosten!$E$7:$E$22,3,1)<>\"N\",Arbeitgeberkosten!K7:'Arbeitgeberkosten'!K22,0))","v":6.65},{"$f":"SUM(IF(MID(Arbeitgeberkosten!$E$7:$E$22,3,1)<>\"N\",Arbeitgeberkosten!L7:'Arbeitgeberkosten'!L22,0))","v":6.65},{"$f":"SUM(IF(MID(Arbeitgeberkosten!$E$7:$E$22,3,1)<>\"N\",Arbeitgeberkosten!M7:'Arbeitgeberkosten'!M22,0))","v":6.65},{"$f":"SUM(IF(MID(Arbeitgeberkosten!$E$7:$E$22,3,1)<>\"N\",Arbeitgeberkosten!N7:'Arbeitgeberkosten'!N22,0))","v":6.65},{"$f":"SUM(IF(MID(Arbeitgeberkosten!$E$7:$E$22,3,1)<>\"N\",Arbeitgeberkosten!O7:'Arbeitgeberkosten'!O22,0))","v":6.65},{"$f":"SUM(IF(MID(Arbeitgeberkosten!$E$7:$E$22,3,1)<>\"N\",Arbeitgeberkosten!P7:'Arbeitgeberkosten'!P22,0))","v":6.65},{"$f":"SUM(IF(MID(Arbeitgeberkosten!$E$7:$E$22,3,1)<>\"N\",Arbeitgeberkosten!Q7:'Arbeitgeberkosten'!Q22,0))","v":6.65}]
["EGA",{"$f":"SUM(B151:B153)","v":0},0,0,0,0,0,0,0,0,0,0,0]
["SV-Brutto ohne EGA",{"$f":"B321-B322","v":6.65},{"$f":"C321-C322","v":6.65},6.65,6.65,6.65,6.65,6.65,6.65,6.65,6.65,6.65,6.65]
["ber. KZVK-Umlage",{"$f":"B318","v":0},{"$f":"C318","v":0},0,0,0,0,0,0,0,0,0,0]
["bereinigtes SV-Brutto",{"$f":"B321-B322+B324","v":6.65},6.65,6.65,6.65,6.65,6.65,6.65,6.65,6.65,6.65,6.65,6.65]
[null,{"$f":"IF(B325<6500,SUM($B$325:B325),A326+6500)","v":6.65},{"$f":"IF(C325<6500,SUM($B$325:C325),B326+6500)","v":13.3},{"$f":"IF(D325<6500,SUM($B$325:D325),C326+6500)","v":19.95},{"$f":"IF(E325<6500,SUM($B$325:E325),D326+6500)","v":26.6},{"$f":"IF(F325<6500,SUM($B$325:F325),E326+6500)","v":33.25},{"$f":"IF(G325<6500,SUM($B$325:G325),F326+6500)","v":39.9},{"$f":"IF(H325<6500,SUM($B$325:H325),G326+6500)","v":46.55},{"$f":"IF(I325<6500,SUM($B$325:I325),H326+6500)","v":53.2},{"$f":"IF(J325<6500,SUM($B$325:J325),I326+6500)","v":59.85},{"$f":"IF(K325<6500,SUM($B$325:K325),J326+6500)","v":66.5},{"$f":"IF(L325<6500,SUM($B$325:L325),K326+6500)","v":73.150000000000006},{"$f":"IF(M325<6500,SUM($B$325:M325),L326+6500)","v":79.8}]
["monatl. Grenze RV-Brutto",{"$f":"Datenausgabe!B$2*Datenausgabe!B134","v":6900},{"$f":"Datenausgabe!C$2*Datenausgabe!C134","v":13800},{"$f":"Datenausgabe!D$2*Datenausgabe!D134","v":20700},{"$f":"Datenausgabe!E$2*Datenausgabe!E134","v":27600},{"$f":"Datenausgabe!F$2*Datenausgabe!F134","v":34500},{"$f":"Datenausgabe!G$2*Datenausgabe!G134","v":41400},{"$f":"Datenausgabe!H$2*Datenausgabe!H134","v":48300},{"$f":"Datenausgabe!I$2*Datenausgabe!I134","v":55200},{"$f":"Datenausgabe!J$2*Datenausgabe!J134","v":62100},{"$f":"Datenausgabe!K$2*Datenausgabe!K134","v":69000},{"$f":"Datenausgabe!L$2*Datenausgabe!L134","v":75900},{"$f":"Datenausgabe!M$2*Datenausgabe!M134","v":82800}]
["monatl. frei für EGA",{"$f":"IF((B327-B326)>B322,B327-B326-B322,B327-B326)","v":6893.35},13786.7,20680.05,27573.4,34466.75,41360.1,48253.45,55146.8,62040.15,68933.5,75826.850000000006,82720.2]
["verbraucht für EGA",{"$f":"IF(B322=0,0,IF((B328-B322)<0,B328,B322))","v":0},0,0,0,0,0,0,0,0,0,0,0]
["monatl. Zur verfügung",{"$f":"Datenausgabe!B134*12","v":82800},{"$f":"IF(B325<6500,B330-B325-B329,B330-6500-B329)","v":82793.350000000006},{"$f":"IF(C325<6500,C330-C325-C329,C330-6500-C329)","v":82786.7},82780.05,82773.399999999994,82766.75,82760.100000000006,82753.45,82746.8,82740.149999999994,82733.5,82726.850000000006]
[null,{"$f":"IF((B330-B323)<0,0,B330-B323)","v":82793.350000000006},{"$f":"IF((C330-C323)<0,0,C330-C323)","v":82786.7},82780.05,82773.399999999994,82766.75,82760.100000000006,82753.45,82746.8,82740.149999999994,82733.5,82726.850000000006,82720.2]

{"sheet":"Hinweise","index":3,"n_rows":43,"n_cols":7,"rows_kept":43,"cut":false,"hidden":false,"merged":[[21,0,22,6],[1,5,5,6],[19,0,20,6],[1,0,1,4],[2,0,2,4],[3,0,3,4],[4,0,4,4],[5,0,5,4]]}
["V 20.1",null,null,null,null,null,"© Bischöfliches Generalvikariat Münster, Gr. 612 Zentrale Gehaltsabrechnungsstelle (ZGASt)"]
["Brutto-Arbeitgeberkosten"]
["Jahres-Nettoberechnung"]
["Monats-Nettoberechnung"]
["Prüfung-GFB"]
[{"$f":"Datenausgabe!A1","v":2020}]
[]
["Enthaltene Tarife:"]
["Ø","Kirchliche Arbeits- und Vertragsordnung (KAVO)"]
["Ø","Kirchliche Arbeits- und Vertragsordnung - Neufassung (KAVO nF)"]
["Ø","Sozial und Erziehungsdienst KAVO"]
["Ø","Sozial und Erziehungsdienst TVöD"]
["Ø","Tarifvertrag öffentlicher Dienst (TVöD)"]
["Ø","Tarifvertrag Länder (TV-L)"]
["Ø","Landesbesoldungsordnungen A, B, C, W"]
["Ø","Priester"]
[]
[]
[]
["(sollte bei einem Mausklick auf den Button \"Berechnung beginnen\" kein Menü erscheinen, aktivieren Sie bitte die Verwendung von Makros!)"]
[]
["Trotz intensiver Testläufe ist nicht auszuschließen, dass diese Excel-Datei Fehler beinhaltet. Es wird keine Gewährleistung oder Haftung für etwaige Schäden, die durch die Installation oder Nutzung entstehen übernommen."]
[]
[]
["Bedienungshinweise:"]
["1.","Menü starten und Werte eingeben"]
[]
["2.","Die Berechnung auf dem Tabellenblatt \"Brutto Arbeitgeberkosten\" überprüfen und ggf. falsche Beträge"]
[null,"korrigieren. Hierbei insbesondere auf Weihnachtsgeld und Einmalzahlungen achten, da z. B."]
[null,"beim Weihnachtsgeld manuell vorgegegebene Zulagen nicht automatisch berücksichtigt werden."]
[]
["3.","Ergänzen der gelben Eingabefelder (z. B. Name, BDA usw.) Diese sind nicht berechnungsrelevant,"]
[null,"und dienen lediglich zur Information. Ausnahme: Beträge für Privatabzüge!"]
[]
["Fragen und Antworten:"]
["F:","Was soll der 6-stellige Klassifzierungsschlüssel? In Kidicap gibt es doch auch nur 5 Stellen...."]
["A:","Auf der 6. Stelle wird mit einem J bzw. N angegeben, ob der Bruttobestandteil bei der Zuwendungs-"]
[null,"berechnung zu berücksichtigen ist."]
[]
["F:","Auf den einzelnen Blättern stehen recht wenige Angaben zu den eingegebenen Tarifdaten. Was tun,"]
[null,"wenn im Ausdruck mehr Daten als Information benötigt werden?"]
["A:","Das zusätzliche Tabellenblatt \"Berechnungsgundlagen\" enthält für jeden Monat die wichtigsten einge-"]
[null,"gebenen Daten. Einfach ausdrucken und mit zur Berechnung legen."]

{"sheet":"Arbeitgeberkosten","index":4,"n_rows":59,"n_cols":19,"rows_kept":59,"cut":false,"hidden":false,"merged":[[57,14,57,15],[1,2,1,3],[2,2,2,3],[3,2,3,3]]}
["Brutto Arbeitgeberkosten",null,null,null,null,{"$f":"Datenausgabe!A1","v":2020}]
[null,"Name",null,null,"Familienstand:",null,{"$f":"Datenausgabe!B32","v":"ledig"},"Tarifgruppe:",{"$f":"Datenausgabe!B6","v":"KAVO nF, EG 15 Ü"},null,null,"StKl.",{"$f":"Datenausgabe!B102","v":1},null,"Zuwendung %:",{"$f":"SUM(IF(Nebenrechnungen!B127:M127>0,Nebenrechnungen!B126:M126,0))","v":0}]
[null,"Vorname:",null,null,"Kinder:",null,{"$f":"Datenausgabe!B36","v":0},"Stufe:",{"$f":"Datenausgabe!B8","v":1},null,null,"KFB:",{"$f":"Datenausgabe!B103","v":0}]
[null,"Geburtsdatum:",null,null,"Personalnummer:",null,null,"Beschäftigungsumfang:",null,{"$f":"Datenausgabe!B20&\" / \"&Datenausgabe!B21","v":"39 / 39"},null,"ST Freibetr.:",{"$f":"Datenausgabe!B108","v":0}]
[]
["Nr.",null,null,null,"Klassif.",{"$f":"DATE(Datenausgabe!$A$1,Datenausgabe!B2,1)","v":"2020-01-01"},{"$f":"DATE(Datenausgabe!$A$1,Datenausgabe!C2,1)","v":"2020-02-01"},{"$f":"DATE(Datenausgabe!$A$1,Datenausgabe!D2,1)","v":"2020-03-01"},{"$f":"DATE(Datenausgabe!$A$1,Datenausgabe!E2,1)","v":"2020-04-01"},{"$f":"DATE(Datenausgabe!$A$1,Datenausgabe!F2,1)","v":"2020-05-01"},{"$f":"DATE(Datenausgabe!$A$1,Datenausgabe!G2,1)","v":"2020-06-01"},{"$f":"DATE(Datenausgabe!$A$1,Datenausgabe!H2,1)","v":"2020-07-01"},{"$f":"DATE(Datenausgabe!$A$1,Datenausgabe!I2,1)","v":"2020-08-01"},{"$f":"DATE(Datenausgabe!$A$1,Datenausgabe!J2,1)","v":"2020-09-01"},{"$f":"DATE(Datenausgabe!$A$1,Datenausgabe!K2,1)","v":"2020-10-01"},{"$f":"DATE(Datenausgabe!$A$1,Datenausgabe!L2,1)","v":"2020-11-01"},{"$f":"DATE(Datenausgabe!$A$1,Datenausgabe!M2,1)","v":"2020-12-01"},"Summe","Gesamt"]
[{"$f":"ROW()-6","v":1},"Grundvergütung",null,null,"JJJJ1J",{"$f":"Nebenrechnungen!B9","v":0},{"$f":"Nebenrechnungen!C9","v":0},{"$f":"Nebenrechnungen!D9","v":0},{"$f":"Nebenrechnungen!E9","v":0},{"$f":"Nebenrechnungen!F9","v":0},{"$f":"Nebenrechnungen!G9","v":0},{"$f":"Nebenrechnungen!H9","v":0},{"$f":"Nebenrechnungen!I9","v":0},{"$f":"Nebenrechnungen!J9","v":0},{"$f":"Nebenrechnungen!K9","v":0},{"$f":"Nebenrechnungen!L9","v":0},{"$f":"Nebenrechnungen!M9","v":0},{"$f":"SUM(F7:Q7)","v":0}]
[{"$f":"ROW()-6","v":2},"Differenz indiv. Stufe",null,null,{"$f":"E7","v":"JJJJ1J"},{"$f":"Nebenrechnungen!B15","v":0},{"$f":"Nebenrechnungen!C15","v":0},{"$f":"Nebenrechnungen!D15","v":0},{"$f":"Nebenrechnungen!E15","v":0},{"$f":"Nebenrechnungen!F15","v":0},{"$f":"Nebenrechnungen!G15","v":0},{"$f":"Nebenrechnungen!H15","v":0},{"$f":"Nebenrechnungen!I15","v":0},{"$f":"Nebenrechnungen!J15","v":0},{"$f":"Nebenrechnungen!K15","v":0},{"$f":"Nebenrechnungen!L15","v":0},{"$f":"Nebenrechnungen!M15","v":0},0]
[{"$f":"ROW()-6","v":3},"OZ ledigen Anteil",null,null,"JJJJ1J",{"$f":"Nebenrechnungen!B22","v":0},{"$f":"Nebenrechnungen!C22","v":0},{"$f":"Nebenrechnungen!D22","v":0},{"$f":"Nebenrechnungen!E22","v":0},{"$f":"Nebenrechnungen!F22","v":0},{"$f":"Nebenrechnungen!G22","v":0},{"$f":"Nebenrechnungen!H22","v":0},{"$f":"Nebenrechnungen!I22","v":0},{"$f":"Nebenrechnungen!J22","v":0},{"$f":"Nebenrechnungen!K22","v":0},{"$f":"Nebenrechnungen!L22","v":0},{"$f":"Nebenrechnungen!M22","v":0},0]
[4,"OZ verh. Anteil",null,null,"JJJJ1J",{"$f":"Nebenrechnungen!B37","v":0},{"$f":"Nebenrechnungen!C37","v":0},{"$f":"Nebenrechnungen!D37","v":0},{"$f":"Nebenrechnungen!E37","v":0},{"$f":"Nebenrechnungen!F37","v":0},{"$f":"Nebenrechnungen!G37","v":0},{"$f":"Nebenrechnungen!H37","v":0},{"$f":"Nebenrechnungen!I37","v":0},{"$f":"Nebenrechnungen!J37","v":0},{"$f":"Nebenrechnungen!K37","v":0},{"$f":"Nebenrechnungen!L37","v":0},{"$f":"Nebenrechnungen!M37","v":0},0]
[5,"OZ Kinder Anteil",null,null,"JJJJ1J",{"$f":"Nebenrechnungen!B54","v":0},{"$f":"Nebenrechnungen!C54","v":0},{"$f":"Nebenrechnungen!D54","v":0},{"$f":"Nebenrechnungen!E54","v":0},{"$f":"Nebenrechnungen!F54","v":0},{"$f":"Nebenrechnungen!G54","v":0},{"$f":"Nebenrechnungen!H54","v":0},{"$f":"Nebenrechnungen!I54","v":0},{"$f":"Nebenrechnungen!J54","v":0},{"$f":"Nebenrechnungen!K54","v":0},{"$f":"Nebenrechnungen!L54","v":0},{"$f":"Nebenrechnungen!M54","v":0},0]
[6,"OZ Kinder erh.",null,null,"JJJJ1J",{"$f":"Nebenrechnungen!B65","v":0},{"$f":"Nebenrechnungen!C65","v":0},{"$f":"Nebenrechnungen!D65","v":0},{"$f":"Nebenrechnungen!E65","v":0},{"$f":"Nebenrechnungen!F65","v":0},{"$f":"Nebenrechnungen!G65","v":0},{"$f":"Nebenrechnungen!H65","v":0},{"$f":"Nebenrechnungen!I65","v":0},{"$f":"Nebenrechnungen!J65","v":0},{"$f":"Nebenrechnungen!K65","v":0},{"$f":"Nebenrechnungen!L65","v":0},{"$f":"Nebenrechnungen!M65","v":0},0]
[7,"Allg. Zulage",null,null,"JJJJ1J",{"$f":"Nebenrechnungen!B72","v":0},{"$f":"Nebenrechnungen!C72","v":0},{"$f":"Nebenrechnungen!D72","v":0},{"$f":"Nebenrechnungen!E72","v":0},{"$f":"Nebenrechnungen!F72","v":0},{"$f":"Nebenrechnungen!G72","v":0},{"$f":"Nebenrechnungen!H72","v":0},{"$f":"Nebenrechnungen!I72","v":0},{"$f":"Nebenrechnungen!J72","v":0},{"$f":"Nebenrechnungen!K72","v":0},{"$f":"Nebenrechnungen!L72","v":0},{"$f":"Nebenrechnungen!M72","v":0},0]
[8,"VL",null,null,"JJJN4N",{"$f":"Nebenrechnungen!B78","v":6.65},{"$f":"Nebenrechnungen!C78","v":6.65},{"$f":"Nebenrechnungen!D78","v":6.65},{"$f":"Nebenrechnungen!E78","v":6.65},{"$f":"Nebenrechnungen!F78","v":6.65},{"$f":"Nebenrechnungen!G78","v":6.65},{"$f":"Nebenrechnungen!H78","v":6.65},{"$f":"Nebenrechnungen!I78","v":6.65},{"$f":"Nebenrechnungen!J78","v":6.65},{"$f":"Nebenrechnungen!K78","v":6.65},{"$f":"Nebenrechnungen!L78","v":6.65},{"$f":"Nebenrechnungen!M78","v":6.65},79.8]
[9,{"$f":"Datenausgabe!B48","v":0},null,null,{"$f":"Datenausgabe!B56","v":"JJJJ1J"},{"$f":"Nebenrechnungen!B84","v":0},{"$f":"Nebenrechnungen!C84","v":0},{"$f":"Nebenrechnungen!D84","v":0},{"$f":"Nebenrechnungen!E84","v":0},{"$f":"Nebenrechnungen!F84","v":0},{"$f":"Nebenrechnungen!G84","v":0},{"$f":"Nebenrechnungen!H84","v":0},{"$f":"Nebenrechnungen!I84","v":0},{"$f":"Nebenrechnungen!J84","v":0},{"$f":"Nebenrechnungen!K84","v":0},{"$f":"Nebenrechnungen!L84","v":0},{"$f":"Nebenrechnungen!M84","v":0},0]
[10,{"$f":"Datenausgabe!B49","v":0},null,null,{"$f":"Datenausgabe!B57","v":"JJJJ1J"},{"$f":"Nebenrechnungen!B90","v":0},{"$f":"Nebenrechnungen!C90","v":0},{"$f":"Nebenrechnungen!D90","v":0},{"$f":"Nebenrechnungen!E90","v":0},{"$f":"Nebenrechnungen!F90","v":0},{"$f":"Nebenrechnungen!G90","v":0},{"$f":"Nebenrechnungen!H90","v":0},{"$f":"Nebenrechnungen!I90","v":0},{"$f":"Nebenrechnungen!J90","v":0},{"$f":"Nebenrechnungen!K90","v":0},{"$f":"Nebenrechnungen!L90","v":0},{"$f":"Nebenrechnungen!M90","v":0},0]
[11,{"$f":"Datenausgabe!B50","v":0},null,null,{"$f":"Datenausgabe!B58","v":"JJJJ1J"},{"$f":"Nebenrechnungen!B96","v":0},{"$f":"Nebenrechnungen!C96","v":0},{"$f":"Nebenrechnungen!D96","v":0},{"$f":"Nebenrechnungen!E96","v":0},{"$f":"Nebenrechnungen!F96","v":0},{"$f":"Nebenrechnungen!G96","v":0},{"$f":"Nebenrechnungen!H96","v":0},{"$f":"Nebenrechnungen!I96","v":0},{"$f":"Nebenrechnungen!J96","v":0},{"$f":"Nebenrechnungen!K96","v":0},{"$f":"Nebenrechnungen!L96","v":0},{"$f":"Nebenrechnungen!M96","v":0},0]
[12,{"$f":"Datenausgabe!B51","v":0},null,null,{"$f":"Datenausgabe!B59","v":"JJJJ1J"},{"$f":"Nebenrechnungen!B102","v":0},{"$f":"Nebenrechnungen!C102","v":0},{"$f":"Nebenrechnungen!D102","v":0},{"$f":"Nebenrechnungen!E102","v":0},{"$f":"Nebenrechnungen!F102","v":0},{"$f":"Nebenrechnungen!G102","v":0},{"$f":"Nebenrechnungen!H102","v":0},{"$f":"Nebenrechnungen!I102","v":0},{"$f":"Nebenrechnungen!J102","v":0},{"$f":"Nebenrechnungen!K102","v":0},{"$f":"Nebenrechnungen!L102","v":0},{"$f":"Nebenrechnungen!M102","v":0},0]
[13,"Urlaubsgeld",null,null,{"$f":"Datenausgabe!B67","v":"JJEN1J"},{"$f":"Nebenrechnungen!B108","v":0},{"$f":"Nebenrechnungen!C108","v":0},{"$f":"Nebenrechnungen!D108","v":0},{"$f":"Nebenrechnungen!E108","v":0},{"$f":"Nebenrechnungen!F108","v":0},{"$f":"Nebenrechnungen!G108","v":0},{"$f":"Nebenrechnungen!H108","v":0},{"$f":"Nebenrechnungen!I108","v":0},{"$f":"Nebenrechnungen!J108","v":0},{"$f":"Nebenrechnungen!K108","v":0},{"$f":"Nebenrechnungen!L108","v":0},{"$f":"Nebenrechnungen!M108","v":0},0]
[14,"Leistungsentgelt",null,null,"JSEJ1N",{"$f":"Nebenrechnungen!B134","v":0},{"$f":"Nebenrechnungen!C134","v":0},{"$f":"Nebenrechnungen!D134","v":0},{"$f":"Nebenrechnungen!E134","v":0},{"$f":"Nebenrechnungen!F134","v":0},{"$f":"Nebenrechnungen!G134","v":0},{"$f":"Nebenrechnungen!H134","v":0},{"$f":"Nebenrechnungen!I134","v":0},{"$f":"Nebenrechnungen!J134","v":0},{"$f":"Nebenrechnungen!K134","v":0},{"$f":"Nebenrechnungen!L134","v":0},{"$f":"Nebenrechnungen!M134","v":0},0]
[15,"Einmalzahlungen",null,null,{"$f":"Datenausgabe!B81","v":"JJEJ1J"},{"$f":"Nebenrechnungen!B116","v":0},{"$f":"Nebenrechnungen!C116","v":0},{"$f":"Nebenrechnungen!D116","v":0},{"$f":"Nebenrechnungen!E116","v":0},{"$f":"Nebenrechnungen!F116","v":0},{"$f":"Nebenrechnungen!G116","v":0},{"$f":"Nebenrechnungen!H116","v":0},{"$f":"Nebenrechnungen!I116","v":0},{"$f":"Nebenrechnungen!J116","v":0},{"$f":"Nebenrechnungen!K116","v":0},{"$f":"Nebenrechnungen!L116","v":0},{"$f":"Nebenrechnungen!M116","v":0},0]
[16,"Sonderzuwendung",null,null,{"$f":"Datenausgabe!B76","v":"JSEJ1J"},{"$f":"Nebenrechnungen!B130","v":0},{"$f":"Nebenrechnungen!C130","v":0},{"$f":"Nebenrechnungen!D130","v":0},{"$f":"Nebenrechnungen!E130","v":0},{"$f":"Nebenrechnungen!F130","v":0},{"$f":"Nebenrechnungen!G130","v":0},{"$f":"Nebenrechnungen!H130","v":0},{"$f":"Nebenrechnungen!I130","v":0},{"$f":"Nebenrechnungen!J130","v":0},{"$f":"Nebenrechnungen!K130","v":0},{"$f":"Nebenrechnungen!L130","v":0},{"$f":"Nebenrechnungen!M130","v":0},0]
[17,"SUMME",null,null,null,{"$f":"SUM(IF(LEFT($E$7:$E$22,1)<>\"N\",F7:F22,0))","v":6.65},{"$f":"SUM(IF(LEFT($E$7:$E$22,1)<>\"N\",G7:G22,0))","v":6.65},{"$f":"SUM(IF(LEFT($E$7:$E$22,1)<>\"N\",H7:H22,0))","v":6.65},{"$f":"SUM(IF(LEFT($E$7:$E$22,1)<>\"N\",I7:I22,0))","v":6.65},{"$f":"SUM(IF(LEFT($E$7:$E$22,1)<>\"N\",J7:J22,0))","v":6.65},{"$f":"SUM(IF(LEFT($E$7:$E$22,1)<>\"N\",K7:K22,0))","v":6.65},{"$f":"SUM(IF(LEFT($E$7:$E$22,1)<>\"N\",L7:L22,0))","v":6.65},{"$f":"SUM(IF(LEFT($E$7:$E$22,1)<>\"N\",M7:M22,0))","v":6.65},{"$f":"SUM(IF(LEFT($E$7:$E$22,1)<>\"N\",N7:N22,0))","v":6.65},{"$f":"SUM(IF(LEFT($E$7:$E$22,1)<>\"N\",O7:O22,0))","v":6.65},{"$f":"SUM(IF(LEFT($E$7:$E$22,1)<>\"N\",P7:P22,0))","v":6.65},{"$f":"SUM(IF(LEFT($E$7:$E$22,1)<>\"N\",Q7:Q22,0))","v":6.65},"Ä",{"$f":"SUM(F23:Q23)","v":79.8}]
[18,"Umlage ZVK steuerfreier Teil",null,null,null,{"$f":"IF(Datenausgabe!B156,IF(Datenausgabe!B157=\"VBL\",Nebenrechnungen!B256,Nebenrechnungen!B277),0)*IF(Datenausgabe!B102=6,0,1)","v":0},{"$f":"IF(Datenausgabe!C157=\"VBL\",Nebenrechnungen!C256,Nebenrechnungen!C277)*IF(Datenausgabe!C102=6,0,1)","v":0},{"$f":"IF(Datenausgabe!D157=\"VBL\",Nebenrechnungen!D256,Nebenrechnungen!D277)*IF(Datenausgabe!D102=6,0,1)","v":0},{"$f":"IF(Datenausgabe!E157=\"VBL\",Nebenrechnungen!E256,Nebenrechnungen!E277)*IF(Datenausgabe!E102=6,0,1)","v":0},{"$f":"IF(Datenausgabe!F157=\"VBL\",Nebenrechnungen!F256,Nebenrechnungen!F277)*IF(Datenausgabe!F102=6,0,1)","v":0},{"$f":"IF(Datenausgabe!G157=\"VBL\",Nebenrechnungen!G256,Nebenrechnungen!G277)*IF(Datenausgabe!G102=6,0,1)","v":0},{"$f":"IF(Datenausgabe!H157=\"VBL\",Nebenrechnungen!H256,Nebenrechnungen!H277)*IF(Datenausgabe!H102=6,0,1)","v":0},{"$f":"IF(Datenausgabe!I157=\"VBL\",Nebenrechnungen!I256,Nebenrechnungen!I277)*IF(Datenausgabe!I102=6,0,1)","v":0},{"$f":"IF(Datenausgabe!J157=\"VBL\",Nebenrechnungen!J256,Nebenrechnungen!J277)*IF(Datenausgabe!J102=6,0,1)","v":0},{"$f":"IF(Datenausgabe!K157=\"VBL\",Nebenrechnungen!K256,Nebenrechnungen!K277)*IF(Datenausgabe!K102=6,0,1)","v":0},{"$f":"IF(Datenausgabe!L157=\"VBL\",Nebenrechnungen!L256,Nebenrechnungen!L277)*IF(Datenausgabe!L102=6,0,1)","v":0},{"$f":"IF(Datenausgabe!M157=\"VBL\",Nebenrechnungen!M256,Nebenrechnungen!M277)*IF(Datenausgabe!M102=6,0,1)","v":0},0]
[19,{"$f":"IF(Datenausgabe!B157=\"VBL\",\"Hinzu. Betrag § 1 Abs. 1 S. 4 SvEV\",\"Umlage ZVK pauschverst. Teil\")","v":"Umlage ZVK pauschverst. Teil"},null,null,null,{"$f":"IF(Datenausgabe!B156,IF(Datenausgabe!B157=\"VBL\",Nebenrechnungen!B264,Nebenrechnungen!B279),0)*IF(Datenausgabe!B102=6,0,1)","v":0},{"$f":"IF(Datenausgabe!C156,IF(Datenausgabe!C157=\"VBL\",Nebenrechnungen!C264,Nebenrechnungen!C279),0)*IF(Datenausgabe!C102=6,0,1)","v":0},{"$f":"IF(Datenausgabe!D156,IF(Datenausgabe!D157=\"VBL\",Nebenrechnungen!D264,Nebenrechnungen!D279),0)*IF(Datenausgabe!D102=6,0,1)","v":0},{"$f":"IF(Datenausgabe!E156,IF(Datenausgabe!E157=\"VBL\",Nebenrechnungen!E264,Nebenrechnungen!E279),0)*IF(Datenausgabe!E102=6,0,1)","v":0},{"$f":"IF(Datenausgabe!F156,IF(Datenausgabe!F157=\"VBL\",Nebenrechnungen!F264,Nebenrechnungen!F279),0)*IF(Datenausgabe!F102=6,0,1)","v":0},{"$f":"IF(Datenausgabe!G156,IF(Datenausgabe!G157=\"VBL\",Nebenrechnungen!G264,Nebenrechnungen!G279),0)*IF(Datenausgabe!G102=6,0,1)","v":0},{"$f":"IF(Datenausgabe!H156,IF(Datenausgabe!H157=\"VBL\",Nebenrechnungen!H264,Nebenrechnungen!H279),0)*IF(Datenausgabe!H102=6,0,1)","v":0},{"$f":"IF(Datenausgabe!I156,IF(Datenausgabe!I157=\"VBL\",Nebenrechnungen!I264,Nebenrechnungen!I279),0)*IF(Datenausgabe!I102=6,0,1)","v":0},{"$f":"IF(Datenausgabe!J156,IF(Datenausgabe!J157=\"VBL\",Nebenrechnungen!J264,Nebenrechnungen!J279),0)*IF(Datenausgabe!J102=6,0,1)","v":0},{"$f":"IF(Datenausgabe!K156,IF(Datenausgabe!K157=\"VBL\",Nebenrechnungen!K264,Nebenrechnungen!K279),0)*IF(Datenausgabe!K102=6,0,1)","v":0},{"$f":"IF(Datenausgabe!L156,IF(Datenausgabe!L157=\"VBL\",Nebenrechnungen!L264,Nebenrechnungen!L279),0)*IF(Datenausgabe!L102=6,0,1)","v":0},{"$f":"IF(Datenausgabe!M156,IF(Datenausgabe!M157=\"VBL\",Nebenrechnungen!M264,Nebenrechnungen!M279),0)*IF(Datenausgabe!M102=6,0,1)","v":0},0]
[20,"Umlage ZVK steuerplichtiger Teil",null,null,null,{"$f":"IF(Datenausgabe!B156,IF(Datenausgabe!B102=6,F46,IF(Datenausgabe!B157=\"VBL\",Nebenrechnungen!B258,Nebenrechnungen!B280)),0)","v":0},{"$f":"IF(Datenausgabe!C156,IF(Datenausgabe!C102=6,G46,IF(Datenausgabe!C157=\"VBL\",Nebenrechnungen!C258,Nebenrechnungen!C280)),0)","v":0},{"$f":"IF(Datenausgabe!D156,IF(Datenausgabe!D102=6,H46,IF(Datenausgabe!D157=\"VBL\",Nebenrechnungen!D258,Nebenrechnungen!D280)),0)","v":0},{"$f":"IF(Datenausgabe!E156,IF(Datenausgabe!E102=6,I46,IF(Datenausgabe!E157=\"VBL\",Nebenrechnungen!E258,Nebenrechnungen!E280)),0)","v":0},{"$f":"IF(Datenausgabe!F156,IF(Datenausgabe!F102=6,J46,IF(Datenausgabe!F157=\"VBL\",Nebenrechnungen!F258,Nebenrechnungen!F280)),0)","v":0},{"$f":"IF(Datenausgabe!G156,IF(Datenausgabe!G102=6,K46,IF(Datenausgabe!G157=\"VBL\",Nebenrechnungen!G258,Nebenrechnungen!G280)),0)","v":0},{"$f":"IF(Datenausgabe!H156,IF(Datenausgabe!H102=6,L46,IF(Datenausgabe!H157=\"VBL\",Nebenrechnungen!H258,Nebenrechnungen!H280)),0)","v":0},{"$f":"IF(Datenausgabe!I156,IF(Datenausgabe!I102=6,M46,IF(Datenausgabe!I157=\"VBL\",Nebenrechnungen!I258,Nebenrechnungen!I280)),0)","v":0},{"$f":"IF(Datenausgabe!J156,IF(Datenausgabe!J102=6,N46,IF(Datenausgabe!J157=\"VBL\",Nebenrechnungen!J258,Nebenrechnungen!J280)),0)","v":0},{"$f":"IF(Datenausgabe!K156,IF(Datenausgabe!K102=6,O46,IF(Datenausgabe!K157=\"VBL\",Nebenrechnungen!K258,Nebenrechnungen!K280)),0)","v":0},{"$f":"IF(Datenausgabe!L156,IF(Datenausgabe!L102=6,P46,IF(Datenausgabe!L157=\"VBL\",Nebenrechnungen!L258,Nebenrechnungen!L280)),0)","v":0},{"$f":"IF(Datenausgabe!M156,IF(Datenausgabe!M102=6,Q46,IF(Datenausgabe!M157=\"VBL\",Nebenrechnungen!M258,Nebenrechnungen!M280)),0)","v":0},0]
[21,{"$f":"IF(Datenausgabe!B157=\"VBL\",\"Hinzu. Betrag § 1 Abs. 1 S. 3 SvEV\",\"Hinzur. Beträge  Sozialversicherung\")","v":"Hinzur. Beträge  Sozialversicherung"},null,null,null,{"$f":"IF(OR(Datenausgabe!B102=6,Datenausgabe!B185),F46,IF(Datenausgabe!B156,IF(Datenausgabe!B157=\"KZVK\",Nebenrechnungen!B288+Nebenrechnungen!B293,Nebenrechnungen!B269),0))","v":0},{"$f":"IF(OR(Datenausgabe!C102=6,Datenausgabe!C185),G46,IF(Datenausgabe!C156,IF(Datenausgabe!C157=\"KZVK\",Nebenrechnungen!C288+Nebenrechnungen!C293,Nebenrechnungen!C269),0))","v":0},{"$f":"IF(OR(Datenausgabe!D102=6,Datenausgabe!D185),H46,IF(Datenausgabe!D156,IF(Datenausgabe!D157=\"KZVK\",Nebenrechnungen!D288+Nebenrechnungen!D293,Nebenrechnungen!D269),0))","v":0},{"$f":"IF(OR(Datenausgabe!E102=6,Datenausgabe!E185),I46,IF(Datenausgabe!E156,IF(Datenausgabe!E157=\"KZVK\",Nebenrechnungen!E288+Nebenrechnungen!E293,Nebenrechnungen!E269),0))","v":0},{"$f":"IF(OR(Datenausgabe!F102=6,Datenausgabe!F185),J46,IF(Datenausgabe!F156,IF(Datenausgabe!F157=\"KZVK\",Nebenrechnungen!F288+Nebenrechnungen!F293,Nebenrechnungen!F269),0))","v":0},{"$f":"IF(OR(Datenausgabe!G102=6,Datenausgabe!G185),K46,IF(Datenausgabe!G156,IF(Datenausgabe!G157=\"KZVK\",Nebenrechnungen!G288+Nebenrechnungen!G293,Nebenrechnungen!G269),0))","v":0},{"$f":"IF(OR(Datenausgabe!H102=6,Datenausgabe!H185),L46,IF(Datenausgabe!H156,IF(Datenausgabe!H157=\"KZVK\",Nebenrechnungen!H288+Nebenrechnungen!H293,Nebenrechnungen!H269),0))","v":0},{"$f":"IF(OR(Datenausgabe!I102=6,Datenausgabe!I185),M46,IF(Datenausgabe!I156,IF(Datenausgabe!I157=\"KZVK\",Nebenrechnungen!I288+Nebenrechnungen!I293,Nebenrechnungen!I269),0))","v":0},{"$f":"IF(OR(Datenausgabe!J102=6,Datenausgabe!J185),N46,IF(Datenausgabe!J156,IF(Datenausgabe!J157=\"KZVK\",Nebenrechnungen!J288+Nebenrechnungen!J293,Nebenrechnungen!J269),0))","v":0},{"$f":"IF(OR(Datenausgabe!K102=6,Datenausgabe!K185),O46,IF(Datenausgabe!K156,IF(Datenausgabe!K157=\"KZVK\",Nebenrechnungen!K288+Nebenrechnungen!K293,Nebenrechnungen!K269),0))","v":0},{"$f":"IF(OR(Datenausgabe!L102=6,Datenausgabe!L185),P46,IF(Datenausgabe!L156,IF(Datenausgabe!L157=\"KZVK\",Nebenrechnungen!L288+Nebenrechnungen!L293,Nebenrechnungen!L269),0))","v":0},{"$f":"IF(OR(Datenausgabe!M102=6,Datenausgabe!M185),Q46,IF(Datenausgabe!M156,IF(Datenausgabe!M157=\"KZVK\",Nebenrechnungen!M288+Nebenrechnungen!M293,Nebenrechnungen!M269),0))","v":0},0]
[22,"Soz. Vers. pfl. Entgelt",null,null,null,{"$f":"IF(Datenausgabe!B129,IF(Datenausgabe!B157=\"VBL\",F25+F26+F27,F27)+SUM(IF(MID($E$7:$E$22,3,1)<>\"N\",F7:F22,0))+(IF(AND(Datenausgabe!B157=\"KZVK\",Datenausgabe!B102<>6),Nebenrechnungen!B318,0)),0)","v":6.65},{"$f":"IF(Datenausgabe!C129,IF(Datenausgabe!C157=\"VBL\",G25+G26+G27,G27)+SUM(IF(MID($E$7:$E$22,3,1)<>\"N\",G7:G22,0))+(IF(AND(Datenausgabe!C157=\"KZVK\",Datenausgabe!C102<>6),Nebenrechnungen!C318,0)),0)","v":6.65},{"$f":"IF(Datenausgabe!D129,IF(Datenausgabe!D157=\"VBL\",H25+H26+H27,H27)+SUM(IF(MID($E$7:$E$22,3,1)<>\"N\",H7:H22,0))+(IF(AND(Datenausgabe!D157=\"KZVK\",Datenausgabe!D102<>6),Nebenrechnungen!D318,0)),0)","v":6.65},{"$f":"IF(Datenausgabe!E129,IF(Datenausgabe!E157=\"VBL\",I25+I26+I27,I27)+SUM(IF(MID($E$7:$E$22,3,1)<>\"N\",I7:I22,0))+(IF(AND(Datenausgabe!E157=\"KZVK\",Datenausgabe!E102<>6),Nebenrechnungen!E318,0)),0)","v":6.65},{"$f":"IF(Datenausgabe!F129,IF(Datenausgabe!F157=\"VBL\",J25+J26+J27,J27)+SUM(IF(MID($E$7:$E$22,3,1)<>\"N\",J7:J22,0))+(IF(AND(Datenausgabe!F157=\"KZVK\",Datenausgabe!F102<>6),Nebenrechnungen!F318,0)),0)","v":6.65},{"$f":"IF(Datenausgabe!G129,IF(Datenausgabe!G157=\"VBL\",K25+K26+K27,K27)+SUM(IF(MID($E$7:$E$22,3,1)<>\"N\",K7:K22,0))+(IF(AND(Datenausgabe!G157=\"KZVK\",Datenausgabe!G102<>6),Nebenrechnungen!G318,0)),0)","v":6.65},{"$f":"IF(Datenausgabe!H129,IF(Datenausgabe!H157=\"VBL\",L25+L26+L27,L27)+SUM(IF(MID($E$7:$E$22,3,1)<>\"N\",L7:L22,0))+(IF(AND(Datenausgabe!H157=\"KZVK\",Datenausgabe!H102<>6),Nebenrechnungen!H318,0)),0)","v":6.65},{"$f":"IF(Datenausgabe!I129,IF(Datenausgabe!I157=\"VBL\",M25+M26+M27,M27)+SUM(IF(MID($E$7:$E$22,3,1)<>\"N\",M7:M22,0))+(IF(AND(Datenausgabe!I157=\"KZVK\",Datenausgabe!I102<>6),Nebenrechnungen!I318,0)),0)","v":6.65},{"$f":"IF(Datenausgabe!J129,IF(Datenausgabe!J157=\"VBL\",N25+N26+N27,N27)+SUM(IF(MID($E$7:$E$22,3,1)<>\"N\",N7:N22,0))+(IF(AND(Datenausgabe!J157=\"KZVK\",Datenausgabe!J102<>6),Nebenrechnungen!J318,0)),0)","v":6.65},{"$f":"IF(Datenausgabe!K129,IF(Datenausgabe!K157=\"VBL\",O25+O26+O27,O27)+SUM(IF(MID($E$7:$E$22,3,1)<>\"N\",O7:O22,0))+(IF(AND(Datenausgabe!K157=\"KZVK\",Datenausgabe!K102<>6),Nebenrechnungen!K318,0)),0)","v":6.65},{"$f":"IF(Datenausgabe!L129,IF(Datenausgabe!L157=\"VBL\",P25+P26+P27,P27)+SUM(IF(MID($E$7:$E$22,3,1)<>\"N\",P7:P22,0))+(IF(AND(Datenausgabe!L157=\"KZVK\",Datenausgabe!L102<>6),Nebenrechnungen!L318,0)),0)","v":6.65},{"$f":"IF(Datenausgabe!M129,IF(Datenausgabe!M157=\"VBL\",Q25+Q26+Q27,Q27)+SUM(IF(MID($E$7:$E$22,3,1)<>\"N\",Q7:Q22,0))+(IF(AND(Datenausgabe!M157=\"KZVK\",Datenausgabe!M102<>6),Nebenrechnungen!M318,0)),0)","v":6.65},79.8]
[23,"KV / PV Brutto ohne Einmalzahlungen",null,null,null,{"$f":"Nebenrechnungen!B160","v":6.65},{"$f":"Nebenrechnungen!C160","v":6.65},{"$f":"Nebenrechnungen!D160","v":6.65},{"$f":"Nebenrechnungen!E160","v":6.65},{"$f":"Nebenrechnungen!F160","v":6.65},{"$f":"Nebenrechnungen!G160","v":6.65},{"$f":"Nebenrechnungen!H160","v":6.65},{"$f":"Nebenrechnungen!I160","v":6.65},{"$f":"Nebenrechnungen!J160","v":6.65},{"$f":"Nebenrechnungen!K160","v":6.65},{"$f":"Nebenrechnungen!L160","v":6.65},{"$f":"Nebenrechnungen!M160","v":6.65},79.8]
[24,"RV / AV Brutto ohne Einmalzahlungen",null,null,null,{"$f":"Nebenrechnungen!B162","v":6.65},{"$f":"Nebenrechnungen!C162","v":6.65},{"$f":"Nebenrechnungen!D162","v":6.65},{"$f":"Nebenrechnungen!E162","v":6.65},{"$f":"Nebenrechnungen!F162","v":6.65},{"$f":"Nebenrechnungen!G162","v":6.65},{"$f":"Nebenrechnungen!H162","v":6.65},{"$f":"Nebenrechnungen!I162","v":6.65},{"$f":"Nebenrechnungen!J162","v":6.65},{"$f":"Nebenrechnungen!K162","v":6.65},{"$f":"Nebenrechnungen!L162","v":6.65},{"$f":"Nebenrechnungen!M162","v":6.65},79.8]
[25,"KV Anteil SB  (EGA-2)",null,null,null,{"$f":"Nebenrechnungen!B171","v":0},{"$f":"Nebenrechnungen!C171","v":0},{"$f":"Nebenrechnungen!D171","v":0},{"$f":"Nebenrechnungen!E171","v":0},{"$f":"Nebenrechnungen!F171","v":0},{"$f":"Nebenrechnungen!G171","v":0},{"$f":"Nebenrechnungen!H171","v":0},{"$f":"Nebenrechnungen!I171","v":0},{"$f":"Nebenrechnungen!J171","v":0},{"$f":"Nebenrechnungen!K171","v":0},{"$f":"Nebenrechnungen!L171","v":0},{"$f":"Nebenrechnungen!M171","v":0},0]
[26,"RV Anteil SB (EGA-2)",null,null,null,{"$f":"Nebenrechnungen!B172","v":0},{"$f":"Nebenrechnungen!C172","v":0},{"$f":"Nebenrechnungen!D172","v":0},{"$f":"Nebenrechnungen!E172","v":0},{"$f":"Nebenrechnungen!F172","v":0},{"$f":"Nebenrechnungen!G172","v":0},{"$f":"Nebenrechnungen!H172","v":0},{"$f":"Nebenrechnungen!I172","v":0},{"$f":"Nebenrechnungen!J172","v":0},{"$f":"Nebenrechnungen!K172","v":0},{"$f":"Nebenrechnungen!L172","v":0},{"$f":"Nebenrechnungen!M172","v":0},0]
[27,"Ermäßigtes Gleitzonen Brutto",null,null,null,{"$f":"IF(Datenausgabe!B175=2,Nebenrechnungen!B177,0)","v":0},{"$f":"IF(Datenausgabe!C175=2,Nebenrechnungen!C177,0)","v":0},{"$f":"IF(Datenausgabe!D175=2,Nebenrechnungen!D177,0)","v":0},{"$f":"IF(Datenausgabe!E175=2,Nebenrechnungen!E177,0)","v":0},{"$f":"IF(Datenausgabe!F175=2,Nebenrechnungen!F177,0)","v":0},{"$f":"IF(Datenausgabe!G175=2,Nebenrechnungen!G177,0)","v":0},{"$f":"IF(Datenausgabe!H175=2,Nebenrechnungen!H177,0)","v":0},{"$f":"IF(Datenausgabe!I175=2,Nebenrechnungen!I177,0)","v":0},{"$f":"IF(Datenausgabe!J175=2,Nebenrechnungen!J177,0)","v":0},{"$f":"IF(Datenausgabe!K175=2,Nebenrechnungen!K177,0)","v":0},{"$f":"IF(Datenausgabe!L175=2,Nebenrechnungen!L177,0)","v":0},{"$f":"IF(Datenausgabe!M175=2,Nebenrechnungen!M177,0)","v":0},0]
[28,"Zus. Vers. pfl. Entgelt",null,null,null,{"$f":"IF(Datenausgabe!B156,SUM(IF(MID($E$7:$E$22,4,1)=\"J\",F7:F22,0)),0)","v":0},{"$f":"IF(Datenausgabe!C156,SUM(IF(MID($E$7:$E$22,4,1)=\"J\",G7:G22,0)),0)","v":0},{"$f":"IF(Datenausgabe!D156,SUM(IF(MID($E$7:$E$22,4,1)=\"J\",H7:H22,0)),0)","v":0},{"$f":"IF(Datenausgabe!E156,SUM(IF(MID($E$7:$E$22,4,1)=\"J\",I7:I22,0)),0)","v":0},{"$f":"IF(Datenausgabe!F156,SUM(IF(MID($E$7:$E$22,4,1)=\"J\",J7:J22,0)),0)","v":0},{"$f":"IF(Datenausgabe!G156,SUM(IF(MID($E$7:$E$22,4,1)=\"J\",K7:K22,0)),0)","v":0},{"$f":"IF(Datenausgabe!H156,SUM(IF(MID($E$7:$E$22,4,1)=\"J\",L7:L22,0)),0)","v":0},{"$f":"IF(Datenausgabe!I156,SUM(IF(MID($E$7:$E$22,4,1)=\"J\",M7:M22,0)),0)","v":0},{"$f":"IF(Datenausgabe!J156,SUM(IF(MID($E$7:$E$22,4,1)=\"J\",N7:N22,0)),0)","v":0},{"$f":"IF(Datenausgabe!K156,SUM(IF(MID($E$7:$E$22,4,1)=\"J\",O7:O22,0)),0)","v":0},{"$f":"IF(Datenausgabe!L156,SUM(IF(MID($E$7:$E$22,4,1)=\"J\",P7:P22,0)),0)","v":0},{"$f":"IF(Datenausgabe!M156,SUM(IF(MID($E$7:$E$22,4,1)=\"J\",Q7:Q22,0)),0)","v":0},0]
[29,{"$f":"IF(Datenausgabe!B175=1,\"Pausch. KV Beitrag\",\"Krankenversicherung\")","v":"Krankenversicherung"},null,null,null,{"$f":"IF(Datenausgabe!B175=2,Nebenrechnungen!B184,IF(Datenausgabe!B175=1,F29*Datenausgabe!B182/100,IF(Datenausgabe!B146=1,Nebenrechnungen!B298,0)))","v":0.52},{"$f":"IF(Datenausgabe!C175=2,Nebenrechnungen!C184,IF(Datenausgabe!C175=1,G29*Datenausgabe!C182/100,IF(Datenausgabe!C146=1,Nebenrechnungen!C298,0)))","v":0.52},{"$f":"IF(Datenausgabe!D175=2,Nebenrechnungen!D184,IF(Datenausgabe!D175=1,H29*Datenausgabe!D182/100,IF(Datenausgabe!D146=1,Nebenrechnungen!D298,0)))","v":0.52},{"$f":"IF(Datenausgabe!E175=2,Nebenrechnungen!E184,IF(Datenausgabe!E175=1,I29*Datenausgabe!E182/100,IF(Datenausgabe!E146=1,Nebenrechnungen!E298,0)))","v":0.52},{"$f":"IF(Datenausgabe!F175=2,Nebenrechnungen!F184,IF(Datenausgabe!F175=1,J29*Datenausgabe!F182/100,IF(Datenausgabe!F146=1,Nebenrechnungen!F298,0)))","v":0.52},{"$f":"IF(Datenausgabe!G175=2,Nebenrechnungen!G184,IF(Datenausgabe!G175=1,K29*Datenausgabe!G182/100,IF(Datenausgabe!G146=1,Nebenrechnungen!G298,0)))","v":0.52},{"$f":"IF(Datenausgabe!H175=2,Nebenrechnungen!H184,IF(Datenausgabe!H175=1,L29*Datenausgabe!H182/100,IF(Datenausgabe!H146=1,Nebenrechnungen!H298,0)))","v":0.52},{"$f":"IF(Datenausgabe!I175=2,Nebenrechnungen!I184,IF(Datenausgabe!I175=1,M29*Datenausgabe!I182/100,IF(Datenausgabe!I146=1,Nebenrechnungen!I298,0)))","v":0.52},{"$f":"IF(Datenausgabe!J175=2,Nebenrechnungen!J184,IF(Datenausgabe!J175=1,N29*Datenausgabe!J182/100,IF(Datenausgabe!J146=1,Nebenrechnungen!J298,0)))","v":0.52},{"$f":"IF(Datenausgabe!K175=2,Nebenrechnungen!K184,IF(Datenausgabe!K175=1,O29*Datenausgabe!K182/100,IF(Datenausgabe!K146=1,Nebenrechnungen!K298,0)))","v":0.52},{"$f":"IF(Datenausgabe!L175=2,Nebenrechnungen!L184,IF(Datenausgabe!L175=1,P29*Datenausgabe!L182/100,IF(Datenausgabe!L146=1,Nebenrechnungen!L298,0)))","v":0.52},{"$f":"IF(Datenausgabe!M175=2,Nebenrechnungen!M184,IF(Datenausgabe!M175=1,Q29*Datenausgabe!M182/100,IF(Datenausgabe!M146=1,Nebenrechnungen!M298,0)))","v":0.52},6.24]
[30,{"$f":"IF(Datenausgabe!B175=1,\"Pausch. RV Beitrag\",\"Rentenversicherung\")","v":"Rentenversicherung"},null,null,null,{"$f":"IF(Datenausgabe!B175=0,F30*Datenausgabe!B140/100,IF(Datenausgabe!B175=1,F30*Datenausgabe!B183/100,Nebenrechnungen!B186))","v":0.62},{"$f":"IF(Datenausgabe!C175=0,G30*Datenausgabe!C140/100,IF(Datenausgabe!C175=1,G30*Datenausgabe!C183/100,Nebenrechnungen!C186))","v":0.62},{"$f":"IF(Datenausgabe!D175=0,H30*Datenausgabe!D140/100,IF(Datenausgabe!D175=1,H30*Datenausgabe!D183/100,Nebenrechnungen!D186))","v":0.62},{"$f":"IF(Datenausgabe!E175=0,I30*Datenausgabe!E140/100,IF(Datenausgabe!E175=1,I30*Datenausgabe!E183/100,Nebenrechnungen!E186))","v":0.62},{"$f":"IF(Datenausgabe!F175=0,J30*Datenausgabe!F140/100,IF(Datenausgabe!F175=1,J30*Datenausgabe!F183/100,Nebenrechnungen!F186))","v":0.62},{"$f":"IF(Datenausgabe!G175=0,K30*Datenausgabe!G140/100,IF(Datenausgabe!G175=1,K30*Datenausgabe!G183/100,Nebenrechnungen!G186))","v":0.62},{"$f":"IF(Datenausgabe!H175=0,L30*Datenausgabe!H140/100,IF(Datenausgabe!H175=1,L30*Datenausgabe!H183/100,Nebenrechnungen!H186))","v":0.62},{"$f":"IF(Datenausgabe!I175=0,M30*Datenausgabe!I140/100,IF(Datenausgabe!I175=1,M30*Datenausgabe!I183/100,Nebenrechnungen!I186))","v":0.62},{"$f":"IF(Datenausgabe!J175=0,N30*Datenausgabe!J140/100,IF(Datenausgabe!J175=1,N30*Datenausgabe!J183/100,Nebenrechnungen!J186))","v":0.62},{"$f":"IF(Datenausgabe!K175=0,O30*Datenausgabe!K140/100,IF(Datenausgabe!K175=1,O30*Datenausgabe!K183/100,Nebenrechnungen!K186))","v":0.62},{"$f":"IF(Datenausgabe!L175=0,P30*Datenausgabe!L140/100,IF(Datenausgabe!L175=1,P30*Datenausgabe!L183/100,Nebenrechnungen!L186))","v":0.62},{"$f":"IF(Datenausgabe!M175=0,Q30*Datenausgabe!M140/100,IF(Datenausgabe!M175=1,Q30*Datenausgabe!M183/100,Nebenrechnungen!M186))","v":0.62},7.44]
[31,{"$f":"IF(Datenausgabe!B175=1,\"\",\"Arbeitslosenversicherung\")","v":"Arbeitslosenversicherung"},null,null,null,{"$f":"IF(Datenausgabe!B175=0,F30*Datenausgabe!B141/100,IF(Datenausgabe!B175=1,F28*0,Nebenrechnungen!B187))","v":0.08},{"$f":"IF(Datenausgabe!C175=0,G30*Datenausgabe!C141/100,IF(Datenausgabe!C175=1,G28*0,Nebenrechnungen!C187))","v":0.08},{"$f":"IF(Datenausgabe!D175=0,H30*Datenausgabe!D141/100,IF(Datenausgabe!D175=1,H28*0,Nebenrechnungen!D187))","v":0.08},{"$f":"IF(Datenausgabe!E175=0,I30*Datenausgabe!E141/100,IF(Datenausgabe!E175=1,I28*0,Nebenrechnungen!E187))","v":0.08},{"$f":"IF(Datenausgabe!F175=0,J30*Datenausgabe!F141/100,IF(Datenausgabe!F175=1,J28*0,Nebenrechnungen!F187))","v":0.08},{"$f":"IF(Datenausgabe!G175=0,K30*Datenausgabe!G141/100,IF(Datenausgabe!G175=1,K28*0,Nebenrechnungen!G187))","v":0.08},{"$f":"IF(Datenausgabe!H175=0,L30*Datenausgabe!H141/100,IF(Datenausgabe!H175=1,L28*0,Nebenrechnungen!H187))","v":0.08},{"$f":"IF(Datenausgabe!I175=0,M30*Datenausgabe!I141/100,IF(Datenausgabe!I175=1,M28*0,Nebenrechnungen!I187))","v":0.08},{"$f":"IF(Datenausgabe!J175=0,N30*Datenausgabe!J141/100,IF(Datenausgabe!J175=1,N28*0,Nebenrechnungen!J187))","v":0.08},{"$f":"IF(Datenausgabe!K175=0,O30*Datenausgabe!K141/100,IF(Datenausgabe!K175=1,O28*0,Nebenrechnungen!K187))","v":0.08},{"$f":"IF(Datenausgabe!L175=0,P30*Datenausgabe!L141/100,IF(Datenausgabe!L175=1,P28*0,Nebenrechnungen!L187))","v":0.08},{"$f":"IF(Datenausgabe!M175=0,Q30*Datenausgabe!M141/100,IF(Datenausgabe!M175=1,Q28*0,Nebenrechnungen!M187))","v":0.08},0.96]
[32,{"$f":"IF(Datenausgabe!B175=1,\"\",\"Pflegeversicherung\")","v":"Pflegeversicherung"},null,null,null,{"$f":"IF(Datenausgabe!B175=2,Nebenrechnungen!B185,IF(Datenausgabe!B175=1,0,IF(Datenausgabe!B146=1,Nebenrechnungen!B303,0)))","v":0.1},{"$f":"IF(Datenausgabe!C175=2,Nebenrechnungen!C185,IF(Datenausgabe!C175=1,0,IF(Datenausgabe!C146=1,Nebenrechnungen!C303,0)))","v":0.1},{"$f":"IF(Datenausgabe!D175=2,Nebenrechnungen!D185,IF(Datenausgabe!D175=1,0,IF(Datenausgabe!D146=1,Nebenrechnungen!D303,0)))","v":0.1},{"$f":"IF(Datenausgabe!E175=2,Nebenrechnungen!E185,IF(Datenausgabe!E175=1,0,IF(Datenausgabe!E146=1,Nebenrechnungen!E303,0)))","v":0.1},{"$f":"IF(Datenausgabe!F175=2,Nebenrechnungen!F185,IF(Datenausgabe!F175=1,0,IF(Datenausgabe!F146=1,Nebenrechnungen!F303,0)))","v":0.1},{"$f":"IF(Datenausgabe!G175=2,Nebenrechnungen!G185,IF(Datenausgabe!G175=1,0,IF(Datenausgabe!G146=1,Nebenrechnungen!G303,0)))","v":0.1},{"$f":"IF(Datenausgabe!H175=2,Nebenrechnungen!H185,IF(Datenausgabe!H175=1,0,IF(Datenausgabe!H146=1,Nebenrechnungen!H303,0)))","v":0.1},{"$f":"IF(Datenausgabe!I175=2,Nebenrechnungen!I185,IF(Datenausgabe!I175=1,0,IF(Datenausgabe!I146=1,Nebenrechnungen!I303,0)))","v":0.1},{"$f":"IF(Datenausgabe!J175=2,Nebenrechnungen!J185,IF(Datenausgabe!J175=1,0,IF(Datenausgabe!J146=1,Nebenrechnungen!J303,0)))","v":0.1},{"$f":"IF(Datenausgabe!K175=2,Nebenrechnungen!K185,IF(Datenausgabe!K175=1,0,IF(Datenausgabe!K146=1,Nebenrechnungen!K303,0)))","v":0.1},{"$f":"IF(Datenausgabe!L175=2,Nebenrechnungen!L185,IF(Datenausgabe!L175=1,0,IF(Datenausgabe!L146=1,Nebenrechnungen!L303,0)))","v":0.1},{"$f":"IF(Datenausgabe!M175=2,Nebenrechnungen!M185,IF(Datenausgabe!M175=1,0,IF(Datenausgabe!M146=1,Nebenrechnungen!M303,0)))","v":0.1},1.2]
[33,{"$f":"IF(Datenausgabe!B175=1,\"Pausch. KV Beitrag für EZ\",\"Krankenversicherung EGA\")","v":"Krankenversicherung EGA"},null,null,null,{"$f":"IF(Datenausgabe!B175=2,0,IF(Datenausgabe!B175=1,F31*Datenausgabe!B182/100,IF(Datenausgabe!B146=1,Nebenrechnungen!B299,0)))","v":0},{"$f":"IF(Datenausgabe!C175=2,0,IF(Datenausgabe!C175=1,G31*Datenausgabe!C182/100,IF(Datenausgabe!C146=1,Nebenrechnungen!C299,0)))","v":0},{"$f":"IF(Datenausgabe!D175=2,0,IF(Datenausgabe!D175=1,H31*Datenausgabe!D182/100,IF(Datenausgabe!D146=1,Nebenrechnungen!D299,0)))","v":0},{"$f":"IF(Datenausgabe!E175=2,0,IF(Datenausgabe!E175=1,I31*Datenausgabe!E182/100,IF(Datenausgabe!E146=1,Nebenrechnungen!E299,0)))","v":0},{"$f":"IF(Datenausgabe!F175=2,0,IF(Datenausgabe!F175=1,J31*Datenausgabe!F182/100,IF(Datenausgabe!F146=1,Nebenrechnungen!F299,0)))","v":0},{"$f":"IF(Datenausgabe!G175=2,0,IF(Datenausgabe!G175=1,K31*Datenausgabe!G182/100,IF(Datenausgabe!G146=1,Nebenrechnungen!G299,0)))","v":0},{"$f":"IF(Datenausgabe!H175=2,0,IF(Datenausgabe!H175=1,L31*Datenausgabe!H182/100,IF(Datenausgabe!H146=1,Nebenrechnungen!H299,0)))","v":0},{"$f":"IF(Datenausgabe!I175=2,0,IF(Datenausgabe!I175=1,M31*Datenausgabe!I182/100,IF(Datenausgabe!I146=1,Nebenrechnungen!I299,0)))","v":0},{"$f":"IF(Datenausgabe!J175=2,0,IF(Datenausgabe!J175=1,N31*Datenausgabe!J182/100,IF(Datenausgabe!J146=1,Nebenrechnungen!J299,0)))","v":0},{"$f":"IF(Datenausgabe!K175=2,0,IF(Datenausgabe!K175=1,O31*Datenausgabe!K182/100,IF(Datenausgabe!K146=1,Nebenrechnungen!K299,0)))","v":0},{"$f":"IF(Datenausgabe!L175=2,0,IF(Datenausgabe!L175=1,P31*Datenausgabe!L182/100,IF(Datenausgabe!L146=1,Nebenrechnungen!L299,0)))","v":0},{"$f":"IF(Datenausgabe!M175=2,0,IF(Datenausgabe!M175=1,Q31*Datenausgabe!M182/100,IF(Datenausgabe!M146=1,Nebenrechnungen!M299,0)))","v":0},0]
[34,{"$f":"IF(Datenausgabe!B175=1,\"Pausch. RV Beitrag für EZ\",\"Rentenversicherung EGA\")","v":"Rentenversicherung EGA"},null,null,null,{"$f":"IF(Datenausgabe!B175=0,F32*Datenausgabe!B140/100,IF(Datenausgabe!B175=1,F32*Datenausgabe!B183/100,0))","v":0},{"$f":"IF(Datenausgabe!C175=0,G32*Datenausgabe!C140/100,IF(Datenausgabe!C175=1,G32*Datenausgabe!C183/100,0))","v":0},{"$f":"IF(Datenausgabe!D175=0,H32*Datenausgabe!D140/100,IF(Datenausgabe!D175=1,H32*Datenausgabe!D183/100,0))","v":0},{"$f":"IF(Datenausgabe!E175=0,I32*Datenausgabe!E140/100,IF(Datenausgabe!E175=1,I32*Datenausgabe!E183/100,0))","v":0},{"$f":"IF(Datenausgabe!F175=0,J32*Datenausgabe!F140/100,IF(Datenausgabe!F175=1,J32*Datenausgabe!F183/100,0))","v":0},{"$f":"IF(Datenausgabe!G175=0,K32*Datenausgabe!G140/100,IF(Datenausgabe!G175=1,K32*Datenausgabe!G183/100,0))","v":0},{"$f":"IF(Datenausgabe!H175=0,L32*Datenausgabe!H140/100,IF(Datenausgabe!H175=1,L32*Datenausgabe!H183/100,0))","v":0},{"$f":"IF(Datenausgabe!I175=0,M32*Datenausgabe!I140/100,IF(Datenausgabe!I175=1,M32*Datenausgabe!I183/100,0))","v":0},{"$f":"IF(Datenausgabe!J175=0,N32*Datenausgabe!J140/100,IF(Datenausgabe!J175=1,N32*Datenausgabe!J183/100,0))","v":0},{"$f":"IF(Datenausgabe!K175=0,O32*Datenausgabe!K140/100,IF(Datenausgabe!K175=1,O32*Datenausgabe!K183/100,0))","v":0},{"$f":"IF(Datenausgabe!L175=0,P32*Datenausgabe!L140/100,IF(Datenausgabe!L175=1,P32*Datenausgabe!L183/100,0))","v":0},{"$f":"IF(Datenausgabe!M175=0,Q32*Datenausgabe!M140/100,IF(Datenausgabe!M175=1,Q32*Datenausgabe!M183/100,0))","v":0},0]
[35,{"$f":"IF(Datenausgabe!B175=1,\"\",\"Arbeitslosenversicherung EGA\")","v":"Arbeitslosenversicherung EGA"},null,null,null,{"$f":"IF(Datenausgabe!B175=0,F32*Datenausgabe!B141/100,F32*0)","v":0},{"$f":"IF(Datenausgabe!C175=0,G32*Datenausgabe!C141/100,G32*0)","v":0},{"$f":"IF(Datenausgabe!D175=0,H32*Datenausgabe!D141/100,H32*0)","v":0},{"$f":"IF(Datenausgabe!E175=0,I32*Datenausgabe!E141/100,I32*0)","v":0},{"$f":"IF(Datenausgabe!F175=0,J32*Datenausgabe!F141/100,J32*0)","v":0},{"$f":"IF(Datenausgabe!G175=0,K32*Datenausgabe!G141/100,K32*0)","v":0},{"$f":"IF(Datenausgabe!H175=0,L32*Datenausgabe!H141/100,L32*0)","v":0},{"$f":"IF(Datenausgabe!I175=0,M32*Datenausgabe!I141/100,M32*0)","v":0},{"$f":"IF(Datenausgabe!J175=0,N32*Datenausgabe!J141/100,N32*0)","v":0},{"$f":"IF(Datenausgabe!K175=0,O32*Datenausgabe!K141/100,O32*0)","v":0},{"$f":"IF(Datenausgabe!L175=0,P32*Datenausgabe!L141/100,P32*0)","v":0},{"$f":"IF(Datenausgabe!M175=0,Q32*Datenausgabe!M141/100,Q32*0)","v":0},0]
[36,{"$f":"IF(Datenausgabe!B175=1,\"\",\"Pflegeversicherung EGA\")","v":"Pflegeversicherung EGA"},null,null,null,{"$f":"IF(Datenausgabe!B175=2,0,IF(Datenausgabe!B175=1,0,IF(Datenausgabe!B146=1,Nebenrechnungen!B304,0)))","v":0},{"$f":"IF(Datenausgabe!C175=2,0,IF(Datenausgabe!C175=1,0,IF(Datenausgabe!C146=1,Nebenrechnungen!C304,0)))","v":0},{"$f":"IF(Datenausgabe!D175=2,0,IF(Datenausgabe!D175=1,0,IF(Datenausgabe!D146=1,Nebenrechnungen!D304,0)))","v":0},{"$f":"IF(Datenausgabe!E175=2,0,IF(Datenausgabe!E175=1,0,IF(Datenausgabe!E146=1,Nebenrechnungen!E304,0)))","v":0},{"$f":"IF(Datenausgabe!F175=2,0,IF(Datenausgabe!F175=1,0,IF(Datenausgabe!F146=1,Nebenrechnungen!F304,0)))","v":0},{"$f":"IF(Datenausgabe!G175=2,0,IF(Datenausgabe!G175=1,0,IF(Datenausgabe!G146=1,Nebenrechnungen!G304,0)))","v":0},{"$f":"IF(Datenausgabe!H175=2,0,IF(Datenausgabe!H175=1,0,IF(Datenausgabe!H146=1,Nebenrechnungen!H304,0)))","v":0},{"$f":"IF(Datenausgabe!I175=2,0,IF(Datenausgabe!I175=1,0,IF(Datenausgabe!I146=1,Nebenrechnungen!I304,0)))","v":0},{"$f":"IF(Datenausgabe!J175=2,0,IF(Datenausgabe!J175=1,0,IF(Datenausgabe!J146=1,Nebenrechnungen!J304,0)))","v":0},{"$f":"IF(Datenausgabe!K175=2,0,IF(Datenausgabe!K175=1,0,IF(Datenausgabe!K146=1,Nebenrechnungen!K304,0)))","v":0},{"$f":"IF(Datenausgabe!L175=2,0,IF(Datenausgabe!L175=1,0,IF(Datenausgabe!L146=1,Nebenrechnungen!L304,0)))","v":0},{"$f":"IF(Datenausgabe!M175=2,0,IF(Datenausgabe!M175=1,0,IF(Datenausgabe!M146=1,Nebenrechnungen!M304,0)))","v":0},0]
[37,{"$f":"IF(Datenausgabe!B175=1,\"Pausch.Lohnsteuer\",\"Freiwillige Kranken- u. Pflegevers.\")","v":"Freiwillige Kranken- u. Pflegevers."},null,null,null,{"$f":"IF(AND(Datenausgabe!B175=1,Datenausgabe!B184=2),F28*Datenausgabe!B181/100,IF(AND(Datenausgabe!B175=0,Nebenrechnungen!B308>0),Nebenrechnungen!B308,0))","v":0},{"$f":"IF(AND(Datenausgabe!C175=1,Datenausgabe!C184=2),G28*Datenausgabe!C181/100,IF(Nebenrechnungen!C308>0,Nebenrechnungen!C308,0))","v":0},{"$f":"IF(AND(Datenausgabe!D175=1,Datenausgabe!D184=2),H28*Datenausgabe!D181/100,IF(Nebenrechnungen!D308>0,Nebenrechnungen!D308,0))","v":0},{"$f":"IF(AND(Datenausgabe!E175=1,Datenausgabe!E184=2),I28*Datenausgabe!E181/100,IF(Nebenrechnungen!E308>0,Nebenrechnungen!E308,0))","v":0},{"$f":"IF(AND(Datenausgabe!F175=1,Datenausgabe!F184=2),J28*Datenausgabe!F181/100,IF(Nebenrechnungen!F308>0,Nebenrechnungen!F308,0))","v":0},{"$f":"IF(AND(Datenausgabe!G175=1,Datenausgabe!G184=2),K28*Datenausgabe!G181/100,IF(Nebenrechnungen!G308>0,Nebenrechnungen!G308,0))","v":0},{"$f":"IF(AND(Datenausgabe!H175=1,Datenausgabe!H184=2),L28*Datenausgabe!H181/100,IF(Nebenrechnungen!H308>0,Nebenrechnungen!H308,0))","v":0},{"$f":"IF(AND(Datenausgabe!I175=1,Datenausgabe!I184=2),M28*Datenausgabe!I181/100,IF(Nebenrechnungen!I308>0,Nebenrechnungen!I308,0))","v":0},{"$f":"IF(AND(Datenausgabe!J175=1,Datenausgabe!J184=2),N28*Datenausgabe!J181/100,IF(Nebenrechnungen!J308>0,Nebenrechnungen!J308,0))","v":0},{"$f":"IF(AND(Datenausgabe!K175=1,Datenausgabe!K184=2),O28*Datenausgabe!K181/100,IF(Nebenrechnungen!K308>0,Nebenrechnungen!K308,0))","v":0},{"$f":"IF(AND(Datenausgabe!L175=1,Datenausgabe!L184=2),P28*Datenausgabe!L181/100,IF(Nebenrechnungen!L308>0,Nebenrechnungen!L308,0))","v":0},{"$f":"IF(AND(Datenausgabe!M175=1,Datenausgabe!M184=2),Q28*Datenausgabe!M181/100,IF(Nebenrechnungen!M308>0,Nebenrechnungen!M308,0))","v":0},0]
[38,{"$f":"IF(R44=0,\"\",\"Umlage nach LFZG\")","v":"Umlage nach LFZG"},null,null,null,{"$f":"IF(OR(Datenausgabe!B136<>0,Datenausgabe!B137<>0),F30/100*(Datenausgabe!B136+Datenausgabe!B137),0)","v":0.01},{"$f":"IF(OR(Datenausgabe!C136<>0,Datenausgabe!C137<>0),G30/100*(Datenausgabe!C136+Datenausgabe!C137),0)","v":0.01},{"$f":"IF(OR(Datenausgabe!D136<>0,Datenausgabe!D137<>0),H30/100*(Datenausgabe!D136+Datenausgabe!D137),0)","v":0.01},{"$f":"IF(OR(Datenausgabe!E136<>0,Datenausgabe!E137<>0),I30/100*(Datenausgabe!E136+Datenausgabe!E137),0)","v":0.01},{"$f":"IF(OR(Datenausgabe!F136<>0,Datenausgabe!F137<>0),J30/100*(Datenausgabe!F136+Datenausgabe!F137),0)","v":0.01},{"$f":"IF(OR(Datenausgabe!G136<>0,Datenausgabe!G137<>0),K30/100*(Datenausgabe!G136+Datenausgabe!G137),0)","v":0.01},{"$f":"IF(OR(Datenausgabe!H136<>0,Datenausgabe!H137<>0),L30/100*(Datenausgabe!H136+Datenausgabe!H137),0)","v":0.01},{"$f":"IF(OR(Datenausgabe!I136<>0,Datenausgabe!I137<>0),M30/100*(Datenausgabe!I136+Datenausgabe!I137),0)","v":0.01},{"$f":"IF(OR(Datenausgabe!J136<>0,Datenausgabe!J137<>0),N30/100*(Datenausgabe!J136+Datenausgabe!J137),0)","v":0.01},{"$f":"IF(OR(Datenausgabe!K136<>0,Datenausgabe!K137<>0),O30/100*(Datenausgabe!K136+Datenausgabe!K137),0)","v":0.01},{"$f":"IF(OR(Datenausgabe!L136<>0,Datenausgabe!L137<>0),P30/100*(Datenausgabe!L136+Datenausgabe!L137),0)","v":0.01},{"$f":"IF(OR(Datenausgabe!M136<>0,Datenausgabe!M137<>0),Q30/100*(Datenausgabe!M136+Datenausgabe!M137),0)","v":0.01},{"$f":"SUM(F44:Q44)","v":0.12}]
[39,"SUMME Arbeitgeberanteile zur SV",null,null,null,{"$f":"SUM(F35:F44)","v":1.33},1.33,1.33,1.33,1.33,1.33,1.33,1.33,1.33,1.33,1.33,1.33,"Ä",{"$f":"SUM(F45:Q45)","v":15.96}]
[40,"Beitrag  Zusatz Vers.",null,null,null,{"$f":"F34*Datenausgabe!B158/100","v":0},{"$f":"G34*Datenausgabe!C158/100","v":0},{"$f":"H34*Datenausgabe!D158/100","v":0},{"$f":"I34*Datenausgabe!E158/100","v":0},{"$f":"J34*Datenausgabe!F158/100","v":0},{"$f":"K34*Datenausgabe!G158/100","v":0},{"$f":"L34*Datenausgabe!H158/100","v":0},{"$f":"M34*Datenausgabe!I158/100","v":0},{"$f":"N34*Datenausgabe!J158/100","v":0},{"$f":"O34*Datenausgabe!K158/100","v":0},{"$f":"P34*Datenausgabe!L158/100","v":0},{"$f":"Q34*Datenausgabe!M158/100","v":0},0]
[41,"Pauschal zu versteuernder Betrag für ZVK",null,null,null,{"$f":"IF(Datenausgabe!B102=6,0,IF(Datenausgabe!B157=\"KZVK\",Nebenrechnungen!B279,Nebenrechnungen!B257))","v":0},{"$f":"IF(Datenausgabe!C102=6,0,IF(Datenausgabe!C157=\"KZVK\",0,Nebenrechnungen!C257))","v":0},{"$f":"IF(Datenausgabe!D102=6,0,IF(Datenausgabe!D157=\"KZVK\",0,Nebenrechnungen!D257))","v":0},{"$f":"IF(Datenausgabe!E102=6,0,IF(Datenausgabe!E157=\"KZVK\",0,Nebenrechnungen!E257))","v":0},{"$f":"IF(Datenausgabe!F102=6,0,IF(Datenausgabe!F157=\"KZVK\",0,Nebenrechnungen!F257))","v":0},{"$f":"IF(Datenausgabe!G102=6,0,IF(Datenausgabe!G157=\"KZVK\",0,Nebenrechnungen!G257))","v":0},{"$f":"IF(Datenausgabe!H102=6,0,IF(Datenausgabe!H157=\"KZVK\",0,Nebenrechnungen!H257))","v":0},{"$f":"IF(Datenausgabe!I102=6,0,IF(Datenausgabe!I157=\"KZVK\",0,Nebenrechnungen!I257))","v":0},{"$f":"IF(Datenausgabe!J102=6,0,IF(Datenausgabe!J157=\"KZVK\",0,Nebenrechnungen!J257))","v":0},{"$f":"IF(Datenausgabe!K102=6,0,IF(Datenausgabe!K157=\"KZVK\",0,Nebenrechnungen!K257))","v":0},{"$f":"IF(Datenausgabe!L102=6,0,IF(Datenausgabe!L157=\"KZVK\",0,Nebenrechnungen!L257))","v":0},{"$f":"IF(Datenausgabe!M102=6,0,IF(Datenausgabe!M157=\"KZVK\",0,Nebenrechnungen!M257))","v":0},0]
[42,"Pauschalsteuer:ZVK & Zulagen",null,null,null,{"$f":"Nebenrechnungen!B146","v":0},{"$f":"Nebenrechnungen!C146","v":0},{"$f":"Nebenrechnungen!D146","v":0},{"$f":"Nebenrechnungen!E146","v":0},{"$f":"Nebenrechnungen!F146","v":0},{"$f":"Nebenrechnungen!G146","v":0},{"$f":"Nebenrechnungen!H146","v":0},{"$f":"Nebenrechnungen!I146","v":0},{"$f":"Nebenrechnungen!J146","v":0},{"$f":"Nebenrechnungen!K146","v":0},{"$f":"Nebenrechnungen!L146","v":0},{"$f":"Nebenrechnungen!M146","v":0},0]
[43,"Sanierungsgeld",null,null,null,{"$f":"IF(Datenausgabe!B157=\"VBL\",F34*Datenausgabe!B164/100,0)","v":0},{"$f":"IF(Datenausgabe!C157=\"VBL\",G34*Datenausgabe!C164/100,0)","v":0},{"$f":"IF(Datenausgabe!D157=\"VBL\",H34*Datenausgabe!D164/100,0)","v":0},{"$f":"IF(Datenausgabe!E157=\"VBL\",I34*Datenausgabe!E164/100,0)","v":0},{"$f":"IF(Datenausgabe!F157=\"VBL\",J34*Datenausgabe!F164/100,0)","v":0},{"$f":"IF(Datenausgabe!G157=\"VBL\",K34*Datenausgabe!G164/100,0)","v":0},{"$f":"IF(Datenausgabe!H157=\"VBL\",L34*Datenausgabe!H164/100,0)","v":0},{"$f":"IF(Datenausgabe!I157=\"VBL\",M34*Datenausgabe!I164/100,0)","v":0},{"$f":"IF(Datenausgabe!J157=\"VBL\",N34*Datenausgabe!J164/100,0)","v":0},{"$f":"IF(Datenausgabe!K157=\"VBL\",O34*Datenausgabe!K164/100,0)","v":0},{"$f":"IF(Datenausgabe!L157=\"VBL\",P34*Datenausgabe!L164/100,0)","v":0},{"$f":"IF(Datenausgabe!M157=\"VBL\",Q34*Datenausgabe!M164/100,0)","v":0},0]
[44,"SUMME Zusatzversorgung",null,null,null,{"$f":"F46+F48+F49","v":0},{"$f":"G46+G48+G49","v":0},0,0,0,0,0,0,0,0,0,0,"Ä",{"$f":"SUM(F50:Q50)","v":0}]
[45,"Gesamtpersonalaufwand",null,null,null,{"$f":"F23+F45+F50","v":7.98},{"$f":"G23+G45+G50","v":7.98},7.98,7.98,7.98,7.98,7.98,7.98,7.98,7.98,7.98,7.98,null,{"$f":"SUM(F51:Q51)","v":95.76}]
["Bemerkungen:",null,null,null,null,null,null,null,null,null,null,null,null,null,null,"Arbeitgeber"]
[]
[]
[]
[]
[]
[null,null,null,null,null,null,null,null,null,null,null,null,null,null,{"$f":"TODAY()","v":"2020-04-03"}]
[null,null,null,null,null,null,null,null,null,null,null,null,null,null,"Ort, Datum",null,null,"Unterschrift"]

{"sheet":"Nettoberechnung Jahr","index":5,"n_rows":62,"n_cols":19,"rows_kept":62,"cut":false,"hidden":false,"merged":[[60,14,60,15],[1,2,1,3],[2,2,2,3],[3,2,3,3]]}
["Netto Entgeltberechnung",null,null,null,null,{"$f":"Datenausgabe!A1","v":2020}]
[null,"Name",{"$f":"Arbeitgeberkosten!C2","v":0},null,"Familienstand:",null,{"$f":"Arbeitgeberkosten!G2","v":"ledig"},"Tarifgruppe:",{"$f":"Datenausgabe!B6","v":"KAVO nF, EG 15 Ü"},null,null,"StKl.",{"$f":"Datenausgabe!B102","v":1},null,"Zuwendung %:",{"$f":"Arbeitgeberkosten!P2","v":0}]
[null,"Vorname:",{"$f":"Arbeitgeberkosten!C3","v":0},null,"Kinder:",null,{"$f":"Arbeitgeberkosten!G3","v":0},"Stufe:",{"$f":"Datenausgabe!B8","v":1},null,null,"KFB:",{"$f":"Datenausgabe!B103","v":0}]
[null,"Geburtsdatum:",{"$f":"Arbeitgeberkosten!C4","v":0},null,"Personalnummer:",null,{"$f":"Arbeitgeberkosten!G4","v":0},"Beschäftigungsumfang:",null,{"$f":"Datenausgabe!B20&\" / \"&Datenausgabe!B21","v":"39 / 39"},null,"ST Freibetr.:",{"$f":"Datenausgabe!B108","v":0}]
["Nr.",null,null,null,"Klassif.",{"$f":"DATE(Datenausgabe!$A$1,Datenausgabe!B2,1)","v":"2020-01-01"},{"$f":"DATE(Datenausgabe!$A$1,Datenausgabe!C2,1)","v":"2020-02-01"},{"$f":"DATE(Datenausgabe!$A$1,Datenausgabe!D2,1)","v":"2020-03-01"},{"$f":"DATE(Datenausgabe!$A$1,Datenausgabe!E2,1)","v":"2020-04-01"},{"$f":"DATE(Datenausgabe!$A$1,Datenausgabe!F2,1)","v":"2020-05-01"},{"$f":"DATE(Datenausgabe!$A$1,Datenausgabe!G2,1)","v":"2020-06-01"},{"$f":"DATE(Datenausgabe!$A$1,Datenausgabe!H2,1)","v":"2020-07-01"},{"$f":"DATE(Datenausgabe!$A$1,Datenausgabe!I2,1)","v":"2020-08-01"},{"$f":"DATE(Datenausgabe!$A$1,Datenausgabe!J2,1)","v":"2020-09-01"},{"$f":"DATE(Datenausgabe!$A$1,Datenausgabe!K2,1)","v":"2020-10-01"},{"$f":"DATE(Datenausgabe!$A$1,Datenausgabe!L2,1)","v":"2020-11-01"},{"$f":"DATE(Datenausgabe!$A$1,Datenausgabe!M2,1)","v":"2020-12-01"},"Summe","Gesamt"]
[{"$f":"ROW()-5","v":1},"Grundvergütung",null,null,"JJJJ1J",{"$f":"Arbeitgeberkosten!F7","v":0},{"$f":"Arbeitgeberkosten!G7","v":0},{"$f":"Arbeitgeberkosten!H7","v":0},{"$f":"Arbeitgeberkosten!I7","v":0},{"$f":"Arbeitgeberkosten!J7","v":0},{"$f":"Arbeitgeberkosten!K7","v":0},{"$f":"Arbeitgeberkosten!L7","v":0},{"$f":"Arbeitgeberkosten!M7","v":0},{"$f":"Arbeitgeberkosten!N7","v":0},{"$f":"Arbeitgeberkosten!O7","v":0},{"$f":"Arbeitgeberkosten!P7","v":0},{"$f":"Arbeitgeberkosten!Q7","v":0},{"$f":"SUM(F6:Q6)","v":0}]
[{"$f":"ROW()-5","v":2},"Differenz indiv. Stufe",null,null,{"$f":"E6","v":"JJJJ1J"},{"$f":"Arbeitgeberkosten!F8","v":0},{"$f":"Arbeitgeberkosten!G8","v":0},{"$f":"Arbeitgeberkosten!H8","v":0},{"$f":"Arbeitgeberkosten!I8","v":0},{"$f":"Arbeitgeberkosten!J8","v":0},{"$f":"Arbeitgeberkosten!K8","v":0},{"$f":"Arbeitgeberkosten!L8","v":0},{"$f":"Arbeitgeberkosten!M8","v":0},{"$f":"Arbeitgeberkosten!N8","v":0},{"$f":"Arbeitgeberkosten!O8","v":0},{"$f":"Arbeitgeberkosten!P8","v":0},{"$f":"Arbeitgeberkosten!Q8","v":0},0]
[3,"OZ ledigen Anteil",null,null,"JJJJ1J",{"$f":"Arbeitgeberkosten!F9","v":0},{"$f":"Arbeitgeberkosten!G9","v":0},{"$f":"Arbeitgeberkosten!H9","v":0},{"$f":"Arbeitgeberkosten!I9","v":0},{"$f":"Arbeitgeberkosten!J9","v":0},{"$f":"Arbeitgeberkosten!K9","v":0},{"$f":"Arbeitgeberkosten!L9","v":0},{"$f":"Arbeitgeberkosten!M9","v":0},{"$f":"Arbeitgeberkosten!N9","v":0},{"$f":"Arbeitgeberkosten!O9","v":0},{"$f":"Arbeitgeberkosten!P9","v":0},{"$f":"Arbeitgeberkosten!Q9","v":0},0]
[4,"OZ verh. Anteil",null,null,"JJJJ1J",{"$f":"Arbeitgeberkosten!F10","v":0},{"$f":"Arbeitgeberkosten!G10","v":0},{"$f":"Arbeitgeberkosten!H10","v":0},{"$f":"Arbeitgeberkosten!I10","v":0},{"$f":"Arbeitgeberkosten!J10","v":0},{"$f":"Arbeitgeberkosten!K10","v":0},{"$f":"Arbeitgeberkosten!L10","v":0},{"$f":"Arbeitgeberkosten!M10","v":0},{"$f":"Arbeitgeberkosten!N10","v":0},{"$f":"Arbeitgeberkosten!O10","v":0},{"$f":"Arbeitgeberkosten!P10","v":0},{"$f":"Arbeitgeberkosten!Q10","v":0},0]
[5,"OZ Kinder Anteil",null,null,"JJJJ1J",{"$f":"Arbeitgeberkosten!F11","v":0},{"$f":"Arbeitgeberkosten!G11","v":0},{"$f":"Arbeitgeberkosten!H11","v":0},{"$f":"Arbeitgeberkosten!I11","v":0},{"$f":"Arbeitgeberkosten!J11","v":0},{"$f":"Arbeitgeberkosten!K11","v":0},{"$f":"Arbeitgeberkosten!L11","v":0},{"$f":"Arbeitgeberkosten!M11","v":0},{"$f":"Arbeitgeberkosten!N11","v":0},{"$f":"Arbeitgeberkosten!O11","v":0},{"$f":"Arbeitgeberkosten!P11","v":0},{"$f":"Arbeitgeberkosten!Q11","v":0},0]
[6,"OZ Kinder erh.",null,null,"JJJJ1J",{"$f":"Arbeitgeberkosten!F12","v":0},{"$f":"Arbeitgeberkosten!G12","v":0},{"$f":"Arbeitgeberkosten!H12","v":0},{"$f":"Arbeitgeberkosten!I12","v":0},{"$f":"Arbeitgeberkosten!J12","v":0},{"$f":"Arbeitgeberkosten!K12","v":0},{"$f":"Arbeitgeberkosten!L12","v":0},{"$f":"Arbeitgeberkosten!M12","v":0},{"$f":"Arbeitgeberkosten!N12","v":0},{"$f":"Arbeitgeberkosten!O12","v":0},{"$f":"Arbeitgeberkosten!P12","v":0},{"$f":"Arbeitgeberkosten!Q12","v":0},0]
[7,"Allg. Zulage",null,null,"JJJJ1J",{"$f":"Arbeitgeberkosten!F13","v":0},{"$f":"Arbeitgeberkosten!G13","v":0},{"$f":"Arbeitgeberkosten!H13","v":0},{"$f":"Arbeitgeberkosten!I13","v":0},{"$f":"Arbeitgeberkosten!J13","v":0},{"$f":"Arbeitgeberkosten!K13","v":0},{"$f":"Arbeitgeberkosten!L13","v":0},{"$f":"Arbeitgeberkosten!M13","v":0},{"$f":"Arbeitgeberkosten!N13","v":0},{"$f":"Arbeitgeberkosten!O13","v":0},{"$f":"Arbeitgeberkosten!P13","v":0},{"$f":"Arbeitgeberkosten!Q13","v":0},0]
[8,"VL",null,null,"JJJN4J",{"$f":"Arbeitgeberkosten!F14","v":6.65},{"$f":"Arbeitgeberkosten!G14","v":6.65},{"$f":"Arbeitgeberkosten!H14","v":6.65},{"$f":"Arbeitgeberkosten!I14","v":6.65},{"$f":"Arbeitgeberkosten!J14","v":6.65},{"$f":"Arbeitgeberkosten!K14","v":6.65},{"$f":"Arbeitgeberkosten!L14","v":6.65},{"$f":"Arbeitgeberkosten!M14","v":6.65},{"$f":"Arbeitgeberkosten!N14","v":6.65},{"$f":"Arbeitgeberkosten!O14","v":6.65},{"$f":"Arbeitgeberkosten!P14","v":6.65},{"$f":"Arbeitgeberkosten!Q14","v":6.65},79.8]
[9,{"$f":"Arbeitgeberkosten!B15","v":0},null,null,{"$f":"Arbeitgeberkosten!E15","v":"JJJJ1J"},{"$f":"Arbeitgeberkosten!F15","v":0},{"$f":"Arbeitgeberkosten!G15","v":0},{"$f":"Arbeitgeberkosten!H15","v":0},{"$f":"Arbeitgeberkosten!I15","v":0},{"$f":"Arbeitgeberkosten!J15","v":0},{"$f":"Arbeitgeberkosten!K15","v":0},{"$f":"Arbeitgeberkosten!L15","v":0},{"$f":"Arbeitgeberkosten!M15","v":0},{"$f":"Arbeitgeberkosten!N15","v":0},{"$f":"Arbeitgeberkosten!O15","v":0},{"$f":"Arbeitgeberkosten!P15","v":0},{"$f":"Arbeitgeberkosten!Q15","v":0},0]
[10,{"$f":"Arbeitgeberkosten!B16","v":0},null,null,{"$f":"Arbeitgeberkosten!E16","v":"JJJJ1J"},{"$f":"Arbeitgeberkosten!F16","v":0},{"$f":"Arbeitgeberkosten!G16","v":0},{"$f":"Arbeitgeberkosten!H16","v":0},{"$f":"Arbeitgeberkosten!I16","v":0},{"$f":"Arbeitgeberkosten!J16","v":0},{"$f":"Arbeitgeberkosten!K16","v":0},{"$f":"Arbeitgeberkosten!L16","v":0},{"$f":"Arbeitgeberkosten!M16","v":0},{"$f":"Arbeitgeberkosten!N16","v":0},{"$f":"Arbeitgeberkosten!O16","v":0},{"$f":"Arbeitgeberkosten!P16","v":0},{"$f":"Arbeitgeberkosten!Q16","v":0},0]
[11,{"$f":"Arbeitgeberkosten!B17","v":0},null,null,{"$f":"Arbeitgeberkosten!E17","v":"JJJJ1J"},{"$f":"Arbeitgeberkosten!F17","v":0},{"$f":"Arbeitgeberkosten!G17","v":0},{"$f":"Arbeitgeberkosten!H17","v":0},{"$f":"Arbeitgeberkosten!I17","v":0},{"$f":"Arbeitgeberkosten!J17","v":0},{"$f":"Arbeitgeberkosten!K17","v":0},{"$f":"Arbeitgeberkosten!L17","v":0},{"$f":"Arbeitgeberkosten!M17","v":0},{"$f":"Arbeitgeberkosten!N17","v":0},{"$f":"Arbeitgeberkosten!O17","v":0},{"$f":"Arbeitgeberkosten!P17","v":0},{"$f":"Arbeitgeberkosten!Q17","v":0},0]
[12,{"$f":"Arbeitgeberkosten!B18","v":0},null,null,{"$f":"Arbeitgeberkosten!E18","v":"JJJJ1J"},{"$f":"Arbeitgeberkosten!F18","v":0},{"$f":"Arbeitgeberkosten!G18","v":0},{"$f":"Arbeitgeberkosten!H18","v":0},{"$f":"Arbeitgeberkosten!I18","v":0},{"$f":"Arbeitgeberkosten!J18","v":0},{"$f":"Arbeitgeberkosten!K18","v":0},{"$f":"Arbeitgeberkosten!L18","v":0},{"$f":"Arbeitgeberkosten!M18","v":0},{"$f":"Arbeitgeberkosten!N18","v":0},{"$f":"Arbeitgeberkosten!O18","v":0},{"$f":"Arbeitgeberkosten!P18","v":0},{"$f":"Arbeitgeberkosten!Q18","v":0},0]
[13,"KV + PV Zuschuss",null,null,"JNNN1N",{"$f":"IF(AND(Arbeitgeberkosten!F43>0,Datenausgabe!B175=0),Arbeitgeberkosten!F43,0)","v":0},{"$f":"IF(AND(Arbeitgeberkosten!G43>0,Datenausgabe!C175=0),Arbeitgeberkosten!G43,0)","v":0},{"$f":"IF(AND(Arbeitgeberkosten!H43>0,Datenausgabe!D175=0),Arbeitgeberkosten!H43,0)","v":0},{"$f":"IF(AND(Arbeitgeberkosten!I43>0,Datenausgabe!E175=0),Arbeitgeberkosten!I43,0)","v":0},{"$f":"IF(AND(Arbeitgeberkosten!J43>0,Datenausgabe!F175=0),Arbeitgeberkosten!J43,0)","v":0},{"$f":"IF(AND(Arbeitgeberkosten!K43>0,Datenausgabe!G175=0),Arbeitgeberkosten!K43,0)","v":0},{"$f":"IF(AND(Arbeitgeberkosten!L43>0,Datenausgabe!H175=0),Arbeitgeberkosten!L43,0)","v":0},{"$f":"IF(AND(Arbeitgeberkosten!M43>0,Datenausgabe!I175=0),Arbeitgeberkosten!M43,0)","v":0},{"$f":"IF(AND(Arbeitgeberkosten!N43>0,Datenausgabe!J175=0),Arbeitgeberkosten!N43,0)","v":0},{"$f":"IF(AND(Arbeitgeberkosten!O43>0,Datenausgabe!K175=0),Arbeitgeberkosten!O43,0)","v":0},{"$f":"IF(AND(Arbeitgeberkosten!P43>0,Datenausgabe!L175=0),Arbeitgeberkosten!P43,0)","v":0},{"$f":"IF(AND(Arbeitgeberkosten!Q43>0,Datenausgabe!M175=0),Arbeitgeberkosten!Q43,0)","v":0}]
[14,"Urlaubsgeld",null,null,{"$f":"Datenausgabe!B67","v":"JJEN1J"},{"$f":"Arbeitgeberkosten!F19","v":0},{"$f":"Arbeitgeberkosten!G19","v":0},{"$f":"Arbeitgeberkosten!H19","v":0},{"$f":"Arbeitgeberkosten!I19","v":0},{"$f":"Arbeitgeberkosten!J19","v":0},{"$f":"Arbeitgeberkosten!K19","v":0},{"$f":"Arbeitgeberkosten!L19","v":0},{"$f":"Arbeitgeberkosten!M19","v":0},{"$f":"Arbeitgeberkosten!N19","v":0},{"$f":"Arbeitgeberkosten!O19","v":0},{"$f":"Arbeitgeberkosten!P19","v":0},{"$f":"Arbeitgeberkosten!Q19","v":0},0]
[15,{"$f":"Arbeitgeberkosten!B20","v":"Leistungsentgelt"},null,null,{"$f":"Arbeitgeberkosten!E20","v":"JSEJ1N"},{"$f":"Arbeitgeberkosten!F20","v":0},{"$f":"Arbeitgeberkosten!G20","v":0},{"$f":"Arbeitgeberkosten!H20","v":0},{"$f":"Arbeitgeberkosten!I20","v":0},{"$f":"Arbeitgeberkosten!J20","v":0},{"$f":"Arbeitgeberkosten!K20","v":0},{"$f":"Arbeitgeberkosten!L20","v":0},{"$f":"Arbeitgeberkosten!M20","v":0},{"$f":"Arbeitgeberkosten!N20","v":0},{"$f":"Arbeitgeberkosten!O20","v":0},{"$f":"Arbeitgeberkosten!P20","v":0},{"$f":"Arbeitgeberkosten!Q20","v":0},0]
[16,"Einmalzahlungen",null,null,{"$f":"Arbeitgeberkosten!E21","v":"JJEJ1J"},{"$f":"Arbeitgeberkosten!F21","v":0},{"$f":"Arbeitgeberkosten!G21","v":0},{"$f":"Arbeitgeberkosten!H21","v":0},{"$f":"Arbeitgeberkosten!I21","v":0},{"$f":"Arbeitgeberkosten!J21","v":0},{"$f":"Arbeitgeberkosten!K21","v":0},{"$f":"Arbeitgeberkosten!L21","v":0},{"$f":"Arbeitgeberkosten!M21","v":0},{"$f":"Arbeitgeberkosten!N21","v":0},{"$f":"Arbeitgeberkosten!O21","v":0},{"$f":"Arbeitgeberkosten!P21","v":0},{"$f":"Arbeitgeberkosten!Q21","v":0},0]
[17,"Sonderzuwendung",null,null,{"$f":"Datenausgabe!B76","v":"JSEJ1J"},{"$f":"Arbeitgeberkosten!F22","v":0},{"$f":"Arbeitgeberkosten!G22","v":0},{"$f":"Arbeitgeberkosten!H22","v":0},{"$f":"Arbeitgeberkosten!I22","v":0},{"$f":"Arbeitgeberkosten!J22","v":0},{"$f":"Arbeitgeberkosten!K22","v":0},{"$f":"Arbeitgeberkosten!L22","v":0},{"$f":"Arbeitgeberkosten!M22","v":0},{"$f":"Arbeitgeberkosten!N22","v":0},{"$f":"Arbeitgeberkosten!O22","v":0},{"$f":"Arbeitgeberkosten!P22","v":0},{"$f":"Arbeitgeberkosten!Q22","v":0},0]
[18,"SUMME",null,null,null,{"$f":"Arbeitgeberkosten!F23+F18","v":6.65},{"$f":"Arbeitgeberkosten!G23+G18","v":6.65},{"$f":"Arbeitgeberkosten!H23+H18","v":6.65},{"$f":"Arbeitgeberkosten!I23+I18","v":6.65},{"$f":"Arbeitgeberkosten!J23+J18","v":6.65},{"$f":"Arbeitgeberkosten!K23+K18","v":6.65},{"$f":"Arbeitgeberkosten!L23+L18","v":6.65},{"$f":"Arbeitgeberkosten!M23+M18","v":6.65},{"$f":"Arbeitgeberkosten!N23+N18","v":6.65},{"$f":"Arbeitgeberkosten!O23+O18","v":6.65},{"$f":"Arbeitgeberkosten!P23+P18","v":6.65},{"$f":"Arbeitgeberkosten!Q23+Q18","v":6.65},"Ä",{"$f":"SUM(F23:Q23)","v":79.8}]
[19,{"$f":"Arbeitgeberkosten!B24","v":"Umlage ZVK steuerfreier Teil"},null,null,null,{"$f":"Arbeitgeberkosten!F24","v":0},{"$f":"Arbeitgeberkosten!G24","v":0},{"$f":"Arbeitgeberkosten!H24","v":0},{"$f":"Arbeitgeberkosten!I24","v":0},{"$f":"Arbeitgeberkosten!J24","v":0},{"$f":"Arbeitgeberkosten!K24","v":0},{"$f":"Arbeitgeberkosten!L24","v":0},{"$f":"Arbeitgeberkosten!M24","v":0},{"$f":"Arbeitgeberkosten!N24","v":0},{"$f":"Arbeitgeberkosten!O24","v":0},{"$f":"Arbeitgeberkosten!P24","v":0},{"$f":"Arbeitgeberkosten!Q24","v":0},{"$f":"SUM(F24:Q24)","v":0}]
[20,{"$f":"Arbeitgeberkosten!B25","v":"Umlage ZVK pauschverst. Teil"},null,null,null,{"$f":"Arbeitgeberkosten!F25","v":0},{"$f":"Arbeitgeberkosten!G25","v":0},{"$f":"Arbeitgeberkosten!H25","v":0},{"$f":"Arbeitgeberkosten!I25","v":0},{"$f":"Arbeitgeberkosten!J25","v":0},{"$f":"Arbeitgeberkosten!K25","v":0},{"$f":"Arbeitgeberkosten!L25","v":0},{"$f":"Arbeitgeberkosten!M25","v":0},{"$f":"Arbeitgeberkosten!N25","v":0},{"$f":"Arbeitgeberkosten!O25","v":0},{"$f":"Arbeitgeberkosten!P25","v":0},{"$f":"Arbeitgeberkosten!Q25","v":0},0]
[21,{"$f":"Arbeitgeberkosten!B26","v":"Umlage ZVK steuerplichtiger Teil"},null,null,null,{"$f":"Arbeitgeberkosten!F26","v":0},{"$f":"Arbeitgeberkosten!G26","v":0},{"$f":"Arbeitgeberkosten!H26","v":0},{"$f":"Arbeitgeberkosten!I26","v":0},{"$f":"Arbeitgeberkosten!J26","v":0},{"$f":"Arbeitgeberkosten!K26","v":0},{"$f":"Arbeitgeberkosten!L26","v":0},{"$f":"Arbeitgeberkosten!M26","v":0},{"$f":"Arbeitgeberkosten!N26","v":0},{"$f":"Arbeitgeberkosten!O26","v":0},{"$f":"Arbeitgeberkosten!P26","v":0},{"$f":"Arbeitgeberkosten!Q26","v":0},0]
[22,{"$f":"Arbeitgeberkosten!B27","v":"Hinzur. Beträge  Sozialversicherung"},null,null,null,{"$f":"Arbeitgeberkosten!F27","v":0},{"$f":"Arbeitgeberkosten!G27","v":0},{"$f":"Arbeitgeberkosten!H27","v":0},{"$f":"Arbeitgeberkosten!I27","v":0},{"$f":"Arbeitgeberkosten!J27","v":0},{"$f":"Arbeitgeberkosten!K27","v":0},{"$f":"Arbeitgeberkosten!L27","v":0},{"$f":"Arbeitgeberkosten!M27","v":0},{"$f":"Arbeitgeberkosten!N27","v":0},{"$f":"Arbeitgeberkosten!O27","v":0},{"$f":"Arbeitgeberkosten!P27","v":0},{"$f":"Arbeitgeberkosten!Q27","v":0},0]
[23,"Soz. Vers. pfl. Entgelt",null,null,null,{"$f":"Arbeitgeberkosten!F28","v":6.65},{"$f":"Arbeitgeberkosten!G28","v":6.65},{"$f":"Arbeitgeberkosten!H28","v":6.65},{"$f":"Arbeitgeberkosten!I28","v":6.65},{"$f":"Arbeitgeberkosten!J28","v":6.65},{"$f":"Arbeitgeberkosten!K28","v":6.65},{"$f":"Arbeitgeberkosten!L28","v":6.65},{"$f":"Arbeitgeberkosten!M28","v":6.65},{"$f":"Arbeitgeberkosten!N28","v":6.65},{"$f":"Arbeitgeberkosten!O28","v":6.65},{"$f":"Arbeitgeberkosten!P28","v":6.65},{"$f":"Arbeitgeberkosten!Q28","v":6.65},79.8]
[24,"KV / PV Brutto ohne Einmalzahlungen",null,null,null,{"$f":"Arbeitgeberkosten!F29","v":6.65},{"$f":"Arbeitgeberkosten!G29","v":6.65},{"$f":"Arbeitgeberkosten!H29","v":6.65},{"$f":"Arbeitgeberkosten!I29","v":6.65},{"$f":"Arbeitgeberkosten!J29","v":6.65},{"$f":"Arbeitgeberkosten!K29","v":6.65},{"$f":"Arbeitgeberkosten!L29","v":6.65},{"$f":"Arbeitgeberkosten!M29","v":6.65},{"$f":"Arbeitgeberkosten!N29","v":6.65},{"$f":"Arbeitgeberkosten!O29","v":6.65},{"$f":"Arbeitgeberkosten!P29","v":6.65},{"$f":"Arbeitgeberkosten!Q29","v":6.65},79.8]
[25,"RV / AV Brutto ohne Einmalzahlungen",null,null,null,{"$f":"Arbeitgeberkosten!F30","v":6.65},{"$f":"Arbeitgeberkosten!G30","v":6.65},{"$f":"Arbeitgeberkosten!H30","v":6.65},{"$f":"Arbeitgeberkosten!I30","v":6.65},{"$f":"Arbeitgeberkosten!J30","v":6.65},{"$f":"Arbeitgeberkosten!K30","v":6.65},{"$f":"Arbeitgeberkosten!L30","v":6.65},{"$f":"Arbeitgeberkosten!M30","v":6.65},{"$f":"Arbeitgeberkosten!N30","v":6.65},{"$f":"Arbeitgeberkosten!O30","v":6.65},{"$f":"Arbeitgeberkosten!P30","v":6.65},{"$f":"Arbeitgeberkosten!Q30","v":6.65},79.8]
[26,"KV Anteil SB  (EGA-2)",null,null,null,{"$f":"Arbeitgeberkosten!F31","v":0},{"$f":"Arbeitgeberkosten!G31","v":0},{"$f":"Arbeitgeberkosten!H31","v":0},{"$f":"Arbeitgeberkosten!I31","v":0},{"$f":"Arbeitgeberkosten!J31","v":0},{"$f":"Arbeitgeberkosten!K31","v":0},{"$f":"Arbeitgeberkosten!L31","v":0},{"$f":"Arbeitgeberkosten!M31","v":0},{"$f":"Arbeitgeberkosten!N31","v":0},{"$f":"Arbeitgeberkosten!O31","v":0},{"$f":"Arbeitgeberkosten!P31","v":0},{"$f":"Arbeitgeberkosten!Q31","v":0},0]
[27,"RV Anteil SB (EGA-2)",null,null,null,{"$f":"Arbeitgeberkosten!F32","v":0},{"$f":"Arbeitgeberkosten!G32","v":0},{"$f":"Arbeitgeberkosten!H32","v":0},{"$f":"Arbeitgeberkosten!I32","v":0},{"$f":"Arbeitgeberkosten!J32","v":0},{"$f":"Arbeitgeberkosten!K32","v":0},{"$f":"Arbeitgeberkosten!L32","v":0},{"$f":"Arbeitgeberkosten!M32","v":0},{"$f":"Arbeitgeberkosten!N32","v":0},{"$f":"Arbeitgeberkosten!O32","v":0},{"$f":"Arbeitgeberkosten!P32","v":0},{"$f":"Arbeitgeberkosten!Q32","v":0},0]
[28,"Ermäßigtes Gleitzonen Brutto",null,null,null,{"$f":"Arbeitgeberkosten!F33","v":0},{"$f":"Arbeitgeberkosten!G33","v":0},{"$f":"Arbeitgeberkosten!H33","v":0},{"$f":"Arbeitgeberkosten!I33","v":0},{"$f":"Arbeitgeberkosten!J33","v":0},{"$f":"Arbeitgeberkosten!K33","v":0},{"$f":"Arbeitgeberkosten!L33","v":0},{"$f":"Arbeitgeberkosten!M33","v":0},{"$f":"Arbeitgeberkosten!N33","v":0},{"$f":"Arbeitgeberkosten!O33","v":0},{"$f":"Arbeitgeberkosten!P33","v":0},{"$f":"Arbeitgeberkosten!Q33","v":0},0]
[29,"Zus. Vers. pfl. Entgelt",null,null,null,{"$f":"Arbeitgeberkosten!F34","v":0},{"$f":"Arbeitgeberkosten!G34","v":0},{"$f":"Arbeitgeberkosten!H34","v":0},{"$f":"Arbeitgeberkosten!I34","v":0},{"$f":"Arbeitgeberkosten!J34","v":0},{"$f":"Arbeitgeberkosten!K34","v":0},{"$f":"Arbeitgeberkosten!L34","v":0},{"$f":"Arbeitgeberkosten!M34","v":0},{"$f":"Arbeitgeberkosten!N34","v":0},{"$f":"Arbeitgeberkosten!O34","v":0},{"$f":"Arbeitgeberkosten!P34","v":0},{"$f":"Arbeitgeberkosten!Q34","v":0},0]
[30,"Steuerpflichtiges Entgelt",null,null,null,{"$f":"IF(Datenausgabe!B101,SUM(IF(MID($E$6:$E$22,2,1)<>\"N\",F6:F22,0))-SUM(IF(MID($E$6:$E$22,2,1)=\"P\",F6:F22,0))+IF(Datenausgabe!B157=\"VBL\",F26,F26),0)-(IF(AND(Datenausgabe!B157=\"KZVK\",Nebenrechnungen!B286=0,Datenausgabe!B102<>6),F54,0))","v":6.65},{"$f":"IF(Datenausgabe!C101,SUM(IF(MID($E$6:$E$22,2,1)<>\"N\",G6:G22,0))-SUM(IF(MID($E$6:$E$22,2,1)=\"P\",G6:G22,0))+IF(Datenausgabe!C157=\"VBL\",G26,G26),0)-(IF(AND(Datenausgabe!C157=\"KZVK\",Nebenrechnungen!C286=0,Datenausgabe!C102<>6),G54,0))","v":6.65},{"$f":"IF(Datenausgabe!D101,SUM(IF(MID($E$6:$E$22,2,1)<>\"N\",H6:H22,0))-SUM(IF(MID($E$6:$E$22,2,1)=\"P\",H6:H22,0))+IF(Datenausgabe!D157=\"VBL\",H26,H26),0)-(IF(AND(Datenausgabe!D157=\"KZVK\",Nebenrechnungen!D286=0,Datenausgabe!D102<>6),H54,0))","v":6.65},{"$f":"IF(Datenausgabe!E101,SUM(IF(MID($E$6:$E$22,2,1)<>\"N\",I6:I22,0))-SUM(IF(MID($E$6:$E$22,2,1)=\"P\",I6:I22,0))+IF(Datenausgabe!E157=\"VBL\",I26,I26),0)-(IF(AND(Datenausgabe!E157=\"KZVK\",Nebenrechnungen!E286=0,Datenausgabe!E102<>6),I54,0))","v":6.65},{"$f":"IF(Datenausgabe!F101,SUM(IF(MID($E$6:$E$22,2,1)<>\"N\",J6:J22,0))-SUM(IF(MID($E$6:$E$22,2,1)=\"P\",J6:J22,0))+IF(Datenausgabe!F157=\"VBL\",J26,J26),0)-(IF(AND(Datenausgabe!F157=\"KZVK\",Nebenrechnungen!F286=0,Datenausgabe!F102<>6),J54,0))","v":6.65},{"$f":"IF(Datenausgabe!G101,SUM(IF(MID($E$6:$E$22,2,1)<>\"N\",K6:K22,0))-SUM(IF(MID($E$6:$E$22,2,1)=\"P\",K6:K22,0))+IF(Datenausgabe!G157=\"VBL\",K26,K26),0)-(IF(AND(Datenausgabe!G157=\"KZVK\",Nebenrechnungen!G286=0,Datenausgabe!G102<>6),K54,0))","v":6.65},{"$f":"IF(Datenausgabe!H101,SUM(IF(MID($E$6:$E$22,2,1)<>\"N\",L6:L22,0))-SUM(IF(MID($E$6:$E$22,2,1)=\"P\",L6:L22,0))+IF(Datenausgabe!H157=\"VBL\",L26,L26),0)-(IF(AND(Datenausgabe!H157=\"KZVK\",Nebenrechnungen!H286=0,Datenausgabe!H102<>6),L54,0))","v":6.65},{"$f":"IF(Datenausgabe!I101,SUM(IF(MID($E$6:$E$22,2,1)<>\"N\",M6:M22,0))-SUM(IF(MID($E$6:$E$22,2,1)=\"P\",M6:M22,0))+IF(Datenausgabe!I157=\"VBL\",M26,M26),0)-(IF(AND(Datenausgabe!I157=\"KZVK\",Nebenrechnungen!I286=0,Datenausgabe!I102<>6),M54,0))","v":6.65},{"$f":"IF(Datenausgabe!J101,SUM(IF(MID($E$6:$E$22,2,1)<>\"N\",N6:N22,0))-SUM(IF(MID($E$6:$E$22,2,1)=\"P\",N6:N22,0))+IF(Datenausgabe!J157=\"VBL\",N26,N26),0)-(IF(AND(Datenausgabe!J157=\"KZVK\",Nebenrechnungen!J286=0,Datenausgabe!J102<>6),N54,0))","v":6.65},{"$f":"IF(Datenausgabe!K101,SUM(IF(MID($E$6:$E$22,2,1)<>\"N\",O6:O22,0))-SUM(IF(MID($E$6:$E$22,2,1)=\"P\",O6:O22,0))+IF(Datenausgabe!K157=\"VBL\",O26,O26),0)-(IF(AND(Datenausgabe!K157=\"KZVK\",Nebenrechnungen!K286=0,Datenausgabe!K102<>6),O54,0))","v":6.65},{"$f":"IF(Datenausgabe!L101,SUM(IF(MID($E$6:$E$22,2,1)<>\"N\",P6:P22,0))-SUM(IF(MID($E$6:$E$22,2,1)=\"P\",P6:P22,0))+IF(Datenausgabe!L157=\"VBL\",P26,P26),0)-(IF(AND(Datenausgabe!L157=\"KZVK\",Nebenrechnungen!L286=0,Datenausgabe!L102<>6),P54,0))","v":6.65},{"$f":"IF(Datenausgabe!M101,SUM(IF(MID($E$6:$E$22,2,1)<>\"N\",Q6:Q22,0))-SUM(IF(MID($E$6:$E$22,2,1)=\"P\",Q6:Q22,0))+IF(Datenausgabe!M157=\"VBL\",Q26,Q26),0)-(IF(AND(Datenausgabe!M157=\"KZVK\",Nebenrechnungen!M286=0,Datenausgabe!M102<>6),Q54,0))","v":6.65},79.8]
[31,"Lohnsteuer",null,null,null,{"$f":"IF(Datenausgabe!B$175=1,IF(Datenausgabe!B184=1,F28*Datenausgabe!B181/100,IF(Datenausgabe!B184=0,Nebenrechnungen!B227,0)),Nebenrechnungen!B227)","v":0},{"$f":"IF(Datenausgabe!C$175=1,IF(Datenausgabe!C184=1,G28*Datenausgabe!C181/100,IF(Datenausgabe!C184=0,Nebenrechnungen!C227,0)),Nebenrechnungen!C227)","v":0},{"$f":"IF(Datenausgabe!D$175=1,IF(Datenausgabe!D184=1,H28*Datenausgabe!D181/100,IF(Datenausgabe!D184=0,Nebenrechnungen!D227,0)),Nebenrechnungen!D227)","v":0},{"$f":"IF(Datenausgabe!E$175=1,IF(Datenausgabe!E184=1,I28*Datenausgabe!E181/100,IF(Datenausgabe!E184=0,Nebenrechnungen!E227,0)),Nebenrechnungen!E227)","v":0},{"$f":"IF(Datenausgabe!F$175=1,IF(Datenausgabe!F184=1,J28*Datenausgabe!F181/100,IF(Datenausgabe!F184=0,Nebenrechnungen!F227,0)),Nebenrechnungen!F227)","v":0},{"$f":"IF(Datenausgabe!G$175=1,IF(Datenausgabe!G184=1,K28*Datenausgabe!G181/100,IF(Datenausgabe!G184=0,Nebenrechnungen!G227,0)),Nebenrechnungen!G227)","v":0},{"$f":"IF(Datenausgabe!H$175=1,IF(Datenausgabe!H184=1,L28*Datenausgabe!H181/100,IF(Datenausgabe!H184=0,Nebenrechnungen!H227,0)),Nebenrechnungen!H227)","v":0},{"$f":"IF(Datenausgabe!I$175=1,IF(Datenausgabe!I184=1,M28*Datenausgabe!I181/100,IF(Datenausgabe!I184=0,Nebenrechnungen!I227,0)),Nebenrechnungen!I227)","v":0},{"$f":"IF(Datenausgabe!J$175=1,IF(Datenausgabe!J184=1,N28*Datenausgabe!J181/100,IF(Datenausgabe!J184=0,Nebenrechnungen!J227,0)),Nebenrechnungen!J227)","v":0},{"$f":"IF(Datenausgabe!K$175=1,IF(Datenausgabe!K184=1,O28*Datenausgabe!K181/100,IF(Datenausgabe!K184=0,Nebenrechnungen!K227,0)),Nebenrechnungen!K227)","v":0},{"$f":"IF(Datenausgabe!L$175=1,IF(Datenausgabe!L184=1,P28*Datenausgabe!L181/100,IF(Datenausgabe!L184=0,Nebenrechnungen!L227,0)),Nebenrechnungen!L227)","v":0},{"$f":"IF(Datenausgabe!M$175=1,IF(Datenausgabe!M184=1,Q28*Datenausgabe!M181/100,IF(Datenausgabe!M184=0,Nebenrechnungen!M227,0)),Nebenrechnungen!M227)","v":0},0]
[32,"Kirchensteuer",null,null,null,{"$f":"IF(Datenausgabe!B$175=1,IF(Datenausgabe!B184=0,Nebenrechnungen!B228,0),Nebenrechnungen!B228)","v":0},{"$f":"IF(Datenausgabe!C$175=1,IF(Datenausgabe!C184=0,Nebenrechnungen!C228,0),Nebenrechnungen!C228)","v":0},{"$f":"IF(Datenausgabe!D$175=1,IF(Datenausgabe!D184=0,Nebenrechnungen!D228,0),Nebenrechnungen!D228)","v":0},{"$f":"IF(Datenausgabe!E$175=1,IF(Datenausgabe!E184=0,Nebenrechnungen!E228,0),Nebenrechnungen!E228)","v":0},{"$f":"IF(Datenausgabe!F$175=1,IF(Datenausgabe!F184=0,Nebenrechnungen!F228,0),Nebenrechnungen!F228)","v":0},{"$f":"IF(Datenausgabe!G$175=1,IF(Datenausgabe!G184=0,Nebenrechnungen!G228,0),Nebenrechnungen!G228)","v":0},{"$f":"IF(Datenausgabe!H$175=1,IF(Datenausgabe!H184=0,Nebenrechnungen!H228,0),Nebenrechnungen!H228)","v":0},{"$f":"IF(Datenausgabe!I$175=1,IF(Datenausgabe!I184=0,Nebenrechnungen!I228,0),Nebenrechnungen!I228)","v":0},{"$f":"IF(Datenausgabe!J$175=1,IF(Datenausgabe!J184=0,Nebenrechnungen!J228,0),Nebenrechnungen!J228)","v":0},{"$f":"IF(Datenausgabe!K$175=1,IF(Datenausgabe!K184=0,Nebenrechnungen!K228,0),Nebenrechnungen!K228)","v":0},{"$f":"IF(Datenausgabe!L$175=1,IF(Datenausgabe!L184=0,Nebenrechnungen!L228,0),Nebenrechnungen!L228)","v":0},{"$f":"IF(Datenausgabe!M$175=1,IF(Datenausgabe!M184=0,Nebenrechnungen!M228,0),Nebenrechnungen!M228)","v":0},0]
[33,"Solidaritätszuschlag",null,null,null,{"$f":"IF(Datenausgabe!B$175=1,IF(Datenausgabe!B184=0,Nebenrechnungen!B229,0),Nebenrechnungen!B229)","v":0},{"$f":"IF(Datenausgabe!C$175=1,IF(Datenausgabe!C184=0,Nebenrechnungen!C229,0),Nebenrechnungen!C229)","v":0},{"$f":"IF(Datenausgabe!D$175=1,IF(Datenausgabe!D184=0,Nebenrechnungen!D229,0),Nebenrechnungen!D229)","v":0},{"$f":"IF(Datenausgabe!E$175=1,IF(Datenausgabe!E184=0,Nebenrechnungen!E229,0),Nebenrechnungen!E229)","v":0},{"$f":"IF(Datenausgabe!F$175=1,IF(Datenausgabe!F184=0,Nebenrechnungen!F229,0),Nebenrechnungen!F229)","v":0},{"$f":"IF(Datenausgabe!G$175=1,IF(Datenausgabe!G184=0,Nebenrechnungen!G229,0),Nebenrechnungen!G229)","v":0},{"$f":"IF(Datenausgabe!H$175=1,IF(Datenausgabe!H184=0,Nebenrechnungen!H229,0),Nebenrechnungen!H229)","v":0},{"$f":"IF(Datenausgabe!I$175=1,IF(Datenausgabe!I184=0,Nebenrechnungen!I229,0),Nebenrechnungen!I229)","v":0},{"$f":"IF(Datenausgabe!J$175=1,IF(Datenausgabe!J184=0,Nebenrechnungen!J229,0),Nebenrechnungen!J229)","v":0},{"$f":"IF(Datenausgabe!K$175=1,IF(Datenausgabe!K184=0,Nebenrechnungen!K229,0),Nebenrechnungen!K229)","v":0},{"$f":"IF(Datenausgabe!L$175=1,IF(Datenausgabe!L184=0,Nebenrechnungen!L229,0),Nebenrechnungen!L229)","v":0},{"$f":"IF(Datenausgabe!M$175=1,IF(Datenausgabe!M184=0,Nebenrechnungen!M229,0),Nebenrechnungen!M229)","v":0},0]
[34,"Lohnsteuer SB",null,null,null,{"$f":"IF(Datenausgabe!B$175=1,IF(Datenausgabe!B184=0,Nebenrechnungen!B230,0),Nebenrechnungen!B230)","v":0},{"$f":"IF(Datenausgabe!C$175=1,IF(Datenausgabe!C184=0,Nebenrechnungen!C230,0),Nebenrechnungen!C230)","v":0},{"$f":"IF(Datenausgabe!D$175=1,IF(Datenausgabe!D184=0,Nebenrechnungen!D230,0),Nebenrechnungen!D230)","v":0},{"$f":"IF(Datenausgabe!E$175=1,IF(Datenausgabe!E184=0,Nebenrechnungen!E230,0),Nebenrechnungen!E230)","v":0},{"$f":"IF(Datenausgabe!F$175=1,IF(Datenausgabe!F184=0,Nebenrechnungen!F230,0),Nebenrechnungen!F230)","v":0},{"$f":"IF(Datenausgabe!G$175=1,IF(Datenausgabe!G184=0,Nebenrechnungen!G230,0),Nebenrechnungen!G230)","v":0},{"$f":"IF(Datenausgabe!H$175=1,IF(Datenausgabe!H184=0,Nebenrechnungen!H230,0),Nebenrechnungen!H230)","v":0},{"$f":"IF(Datenausgabe!I$175=1,IF(Datenausgabe!I184=0,Nebenrechnungen!I230,0),Nebenrechnungen!I230)","v":0},{"$f":"IF(Datenausgabe!J$175=1,IF(Datenausgabe!J184=0,Nebenrechnungen!J230,0),Nebenrechnungen!J230)","v":0},{"$f":"IF(Datenausgabe!K$175=1,IF(Datenausgabe!K184=0,Nebenrechnungen!K230,0),Nebenrechnungen!K230)","v":0},{"$f":"IF(Datenausgabe!L$175=1,IF(Datenausgabe!L184=0,Nebenrechnungen!L230,0),Nebenrechnungen!L230)","v":0},{"$f":"IF(Datenausgabe!M$175=1,IF(Datenausgabe!M184=0,Nebenrechnungen!M230,0),Nebenrechnungen!M230)","v":0},0]
[35,"Kirchensteuer SB",null,null,null,{"$f":"IF(Datenausgabe!B$175=1,IF(Datenausgabe!B184=0,Nebenrechnungen!B231,0),Nebenrechnungen!B231)","v":0},{"$f":"IF(Datenausgabe!C$175=1,IF(Datenausgabe!C184=0,Nebenrechnungen!C231,0),Nebenrechnungen!C231)","v":0},{"$f":"IF(Datenausgabe!D$175=1,IF(Datenausgabe!D184=0,Nebenrechnungen!D231,0),Nebenrechnungen!D231)","v":0},{"$f":"IF(Datenausgabe!E$175=1,IF(Datenausgabe!E184=0,Nebenrechnungen!E231,0),Nebenrechnungen!E231)","v":0},{"$f":"IF(Datenausgabe!F$175=1,IF(Datenausgabe!F184=0,Nebenrechnungen!F231,0),Nebenrechnungen!F231)","v":0},{"$f":"IF(Datenausgabe!G$175=1,IF(Datenausgabe!G184=0,Nebenrechnungen!G231,0),Nebenrechnungen!G231)","v":0},{"$f":"IF(Datenausgabe!H$175=1,IF(Datenausgabe!H184=0,Nebenrechnungen!H231,0),Nebenrechnungen!H231)","v":0},{"$f":"IF(Datenausgabe!I$175=1,IF(Datenausgabe!I184=0,Nebenrechnungen!I231,0),Nebenrechnungen!I231)","v":0},{"$f":"IF(Datenausgabe!J$175=1,IF(Datenausgabe!J184=0,Nebenrechnungen!J231,0),Nebenrechnungen!J231)","v":0},{"$f":"IF(Datenausgabe!K$175=1,IF(Datenausgabe!K184=0,Nebenrechnungen!K231,0),Nebenrechnungen!K231)","v":0},{"$f":"IF(Datenausgabe!L$175=1,IF(Datenausgabe!L184=0,Nebenrechnungen!L231,0),Nebenrechnungen!L231)","v":0},{"$f":"IF(Datenausgabe!M$175=1,IF(Datenausgabe!M184=0,Nebenrechnungen!M231,0),Nebenrechnungen!M231)","v":0},0]
[36,"Solidaritätszuschlag SB",null,null,null,{"$f":"IF(Datenausgabe!B$175=1,IF(Datenausgabe!B184=0,Nebenrechnungen!B232,0),Nebenrechnungen!B232)","v":0},{"$f":"IF(Datenausgabe!C$175=1,IF(Datenausgabe!C184=0,Nebenrechnungen!C232,0),Nebenrechnungen!C232)","v":0},{"$f":"IF(Datenausgabe!D$175=1,IF(Datenausgabe!D184=0,Nebenrechnungen!D232,0),Nebenrechnungen!D232)","v":0},{"$f":"IF(Datenausgabe!E$175=1,IF(Datenausgabe!E184=0,Nebenrechnungen!E232,0),Nebenrechnungen!E232)","v":0},{"$f":"IF(Datenausgabe!F$175=1,IF(Datenausgabe!F184=0,Nebenrechnungen!F232,0),Nebenrechnungen!F232)","v":0},{"$f":"IF(Datenausgabe!G$175=1,IF(Datenausgabe!G184=0,Nebenrechnungen!G232,0),Nebenrechnungen!G232)","v":0},{"$f":"IF(Datenausgabe!H$175=1,IF(Datenausgabe!H184=0,Nebenrechnungen!H232,0),Nebenrechnungen!H232)","v":0},{"$f":"IF(Datenausgabe!I$175=1,IF(Datenausgabe!I184=0,Nebenrechnungen!I232,0),Nebenrechnungen!I232)","v":0},{"$f":"IF(Datenausgabe!J$175=1,IF(Datenausgabe!J184=0,Nebenrechnungen!J232,0),Nebenrechnungen!J232)","v":0},{"$f":"IF(Datenausgabe!K$175=1,IF(Datenausgabe!K184=0,Nebenrechnungen!K232,0),Nebenrechnungen!K232)","v":0},{"$f":"IF(Datenausgabe!L$175=1,IF(Datenausgabe!L184=0,Nebenrechnungen!L232,0),Nebenrechnungen!L232)","v":0},{"$f":"IF(Datenausgabe!M$175=1,IF(Datenausgabe!M184=0,Nebenrechnungen!M232,0),Nebenrechnungen!M232)","v":0},0]
[37,{"$f":"IF(Datenausgabe!B175=1,\"Pausch. KV Beitrag\",\"Krankenversicherung\")","v":"Krankenversicherung"},null,null,null,{"$f":"IF(Datenausgabe!B175=2,Nebenrechnungen!B189,IF(Datenausgabe!B175=1,0,IF(Datenausgabe!B146=1,Nebenrechnungen!B300,0)))","v":0.52},{"$f":"IF(Datenausgabe!C175=2,Nebenrechnungen!C189,IF(Datenausgabe!C175=1,0,IF(Datenausgabe!C146=1,Nebenrechnungen!C300,0)))","v":0.52},{"$f":"IF(Datenausgabe!D175=2,Nebenrechnungen!D189,IF(Datenausgabe!D175=1,0,IF(Datenausgabe!D146=1,Nebenrechnungen!D300,0)))","v":0.52},{"$f":"IF(Datenausgabe!E175=2,Nebenrechnungen!E189,IF(Datenausgabe!E175=1,0,IF(Datenausgabe!E146=1,Nebenrechnungen!E300,0)))","v":0.52},{"$f":"IF(Datenausgabe!F175=2,Nebenrechnungen!F189,IF(Datenausgabe!F175=1,0,IF(Datenausgabe!F146=1,Nebenrechnungen!F300,0)))","v":0.52},{"$f":"IF(Datenausgabe!G175=2,Nebenrechnungen!G189,IF(Datenausgabe!G175=1,0,IF(Datenausgabe!G146=1,Nebenrechnungen!G300,0)))","v":0.52},{"$f":"IF(Datenausgabe!H175=2,Nebenrechnungen!H189,IF(Datenausgabe!H175=1,0,IF(Datenausgabe!H146=1,Nebenrechnungen!H300,0)))","v":0.52},{"$f":"IF(Datenausgabe!I175=2,Nebenrechnungen!I189,IF(Datenausgabe!I175=1,0,IF(Datenausgabe!I146=1,Nebenrechnungen!I300,0)))","v":0.52},{"$f":"IF(Datenausgabe!J175=2,Nebenrechnungen!J189,IF(Datenausgabe!J175=1,0,IF(Datenausgabe!J146=1,Nebenrechnungen!J300,0)))","v":0.52},{"$f":"IF(Datenausgabe!K175=2,Nebenrechnungen!K189,IF(Datenausgabe!K175=1,0,IF(Datenausgabe!K146=1,Nebenrechnungen!K300,0)))","v":0.52},{"$f":"IF(Datenausgabe!L175=2,Nebenrechnungen!L189,IF(Datenausgabe!L175=1,0,IF(Datenausgabe!L146=1,Nebenrechnungen!L300,0)))","v":0.52},{"$f":"IF(Datenausgabe!M175=2,Nebenrechnungen!M189,IF(Datenausgabe!M175=1,0,IF(Datenausgabe!M146=1,Nebenrechnungen!M300,0)))","v":0.52},6.24]
[38,{"$f":"IF(Datenausgabe!B175=1,\"Pausch. RV Beitrag\",\"Rentenversicherung\")","v":"Rentenversicherung"},null,null,null,{"$f":"IF(Datenausgabe!B175=0,ROUND(F30*Datenausgabe!B140/100,2)+ROUND(F30*Datenausgabe!B144/100,2),IF(Datenausgabe!B175=1,0,Nebenrechnungen!B191))","v":0.62},{"$f":"IF(Datenausgabe!C175=0,ROUND(G30*Datenausgabe!C140/100,2)+ROUND(G30*Datenausgabe!C144/100,2),IF(Datenausgabe!C175=1,0,Nebenrechnungen!C191))","v":0.62},{"$f":"IF(Datenausgabe!D175=0,ROUND(H30*Datenausgabe!D140/100,2)+ROUND(H30*Datenausgabe!D144/100,2),IF(Datenausgabe!D175=1,0,Nebenrechnungen!D191))","v":0.62},{"$f":"IF(Datenausgabe!E175=0,ROUND(I30*Datenausgabe!E140/100,2)+ROUND(I30*Datenausgabe!E144/100,2),IF(Datenausgabe!E175=1,0,Nebenrechnungen!E191))","v":0.62},{"$f":"IF(Datenausgabe!F175=0,ROUND(J30*Datenausgabe!F140/100,2)+ROUND(J30*Datenausgabe!F144/100,2),IF(Datenausgabe!F175=1,0,Nebenrechnungen!F191))","v":0.62},{"$f":"IF(Datenausgabe!G175=0,ROUND(K30*Datenausgabe!G140/100,2)+ROUND(K30*Datenausgabe!G144/100,2),IF(Datenausgabe!G175=1,0,Nebenrechnungen!G191))","v":0.62},{"$f":"IF(Datenausgabe!H175=0,ROUND(L30*Datenausgabe!H140/100,2)+ROUND(L30*Datenausgabe!H144/100,2),IF(Datenausgabe!H175=1,0,Nebenrechnungen!H191))","v":0.62},{"$f":"IF(Datenausgabe!I175=0,ROUND(M30*Datenausgabe!I140/100,2)+ROUND(M30*Datenausgabe!I144/100,2),IF(Datenausgabe!I175=1,0,Nebenrechnungen!I191))","v":0.62},{"$f":"IF(Datenausgabe!J175=0,ROUND(N30*Datenausgabe!J140/100,2)+ROUND(N30*Datenausgabe!J144/100,2),IF(Datenausgabe!J175=1,0,Nebenrechnungen!J191))","v":0.62},{"$f":"IF(Datenausgabe!K175=0,ROUND(O30*Datenausgabe!K140/100,2)+ROUND(O30*Datenausgabe!K144/100,2),IF(Datenausgabe!K175=1,0,Nebenrechnungen!K191))","v":0.62},{"$f":"IF(Datenausgabe!L175=0,ROUND(P30*Datenausgabe!L140/100,2)+ROUND(P30*Datenausgabe!L144/100,2),IF(Datenausgabe!L175=1,0,Nebenrechnungen!L191))","v":0.62},{"$f":"IF(Datenausgabe!M175=0,ROUND(Q30*Datenausgabe!M140/100,2)+ROUND(Q30*Datenausgabe!M144/100,2),IF(Datenausgabe!M175=1,0,Nebenrechnungen!M191))","v":0.62},7.44]
[39,{"$f":"IF(Datenausgabe!B175=1,\"Aufstockung RV\",\"Arbeitslosenversicherung\")","v":"Arbeitslosenversicherung"},null,null,null,{"$f":"IF(Datenausgabe!B175=0,ROUND(F30*Datenausgabe!B141/100,2)+ROUND(F30*Datenausgabe!B145/100,2),IF(Datenausgabe!B175=1,IF(Datenausgabe!B186,F30*(2*Datenausgabe!B140-Datenausgabe!B183)/100,0),Nebenrechnungen!B192))","v":0.08},{"$f":"IF(Datenausgabe!C175=0,ROUND(G30*Datenausgabe!C141/100,2)+ROUND(G30*Datenausgabe!C145/100,2),IF(Datenausgabe!C175=1,IF(Datenausgabe!C186,G30*(2*Datenausgabe!C140-Datenausgabe!C183)/100,0),Nebenrechnungen!C192))","v":0.08},{"$f":"IF(Datenausgabe!D175=0,ROUND(H30*Datenausgabe!D141/100,2)+ROUND(H30*Datenausgabe!D145/100,2),IF(Datenausgabe!D175=1,IF(Datenausgabe!D186,H30*(2*Datenausgabe!D140-Datenausgabe!D183)/100,0),Nebenrechnungen!D192))","v":0.08},{"$f":"IF(Datenausgabe!E175=0,ROUND(I30*Datenausgabe!E141/100,2)+ROUND(I30*Datenausgabe!E145/100,2),IF(Datenausgabe!E175=1,IF(Datenausgabe!E186,I30*(2*Datenausgabe!E140-Datenausgabe!E183)/100,0),Nebenrechnungen!E192))","v":0.08},{"$f":"IF(Datenausgabe!F175=0,ROUND(J30*Datenausgabe!F141/100,2)+ROUND(J30*Datenausgabe!F145/100,2),IF(Datenausgabe!F175=1,IF(Datenausgabe!F186,J30*(2*Datenausgabe!F140-Datenausgabe!F183)/100,0),Nebenrechnungen!F192))","v":0.08},{"$f":"IF(Datenausgabe!G175=0,ROUND(K30*Datenausgabe!G141/100,2)+ROUND(K30*Datenausgabe!G145/100,2),IF(Datenausgabe!G175=1,IF(Datenausgabe!G186,K30*(2*Datenausgabe!G140-Datenausgabe!G183)/100,0),Nebenrechnungen!G192))","v":0.08},{"$f":"IF(Datenausgabe!H175=0,ROUND(L30*Datenausgabe!H141/100,2)+ROUND(L30*Datenausgabe!H145/100,2),IF(Datenausgabe!H175=1,IF(Datenausgabe!H186,L30*(2*Datenausgabe!H140-Datenausgabe!H183)/100,0),Nebenrechnungen!H192))","v":0.08},{"$f":"IF(Datenausgabe!I175=0,ROUND(M30*Datenausgabe!I141/100,2)+ROUND(M30*Datenausgabe!I145/100,2),IF(Datenausgabe!I175=1,IF(Datenausgabe!I186,M30*(2*Datenausgabe!I140-Datenausgabe!I183)/100,0),Nebenrechnungen!I192))","v":0.08},{"$f":"IF(Datenausgabe!J175=0,ROUND(N30*Datenausgabe!J141/100,2)+ROUND(N30*Datenausgabe!J145/100,2),IF(Datenausgabe!J175=1,IF(Datenausgabe!J186,N30*(2*Datenausgabe!J140-Datenausgabe!J183)/100,0),Nebenrechnungen!J192))","v":0.08},{"$f":"IF(Datenausgabe!K175=0,ROUND(O30*Datenausgabe!K141/100,2)+ROUND(O30*Datenausgabe!K145/100,2),IF(Datenausgabe!K175=1,IF(Datenausgabe!K186,O30*(2*Datenausgabe!K140-Datenausgabe!K183)/100,0),Nebenrechnungen!K192))","v":0.08},{"$f":"IF(Datenausgabe!L175=0,ROUND(P30*Datenausgabe!L141/100,2)+ROUND(P30*Datenausgabe!L145/100,2),IF(Datenausgabe!L175=1,IF(Datenausgabe!L186,P30*(2*Datenausgabe!L140-Datenausgabe!L183)/100,0),Nebenrechnungen!L192))","v":0.08},{"$f":"IF(Datenausgabe!M175=0,ROUND(Q30*Datenausgabe!M141/100,2)+ROUND(Q30*Datenausgabe!M145/100,2),IF(Datenausgabe!M175=1,IF(Datenausgabe!M186,Q30*(2*Datenausgabe!M140-Datenausgabe!M183)/100,0),Nebenrechnungen!M192))","v":0.08},0.96]
[40,{"$f":"IF(Datenausgabe!B175=1,\"\",\"Pflegeversicherung\")","v":"Pflegeversicherung"},null,null,null,{"$f":"IF(Datenausgabe!B175=2,Nebenrechnungen!B190,IF(Datenausgabe!B175=1,0,IF(Datenausgabe!B146=1,Nebenrechnungen!B305,0)))","v":0.12},{"$f":"IF(Datenausgabe!C175=2,Nebenrechnungen!C190,IF(Datenausgabe!C175=1,0,IF(Datenausgabe!C146=1,Nebenrechnungen!C305,0)))","v":0.12},{"$f":"IF(Datenausgabe!D175=2,Nebenrechnungen!D190,IF(Datenausgabe!D175=1,0,IF(Datenausgabe!D146=1,Nebenrechnungen!D305,0)))","v":0.12},{"$f":"IF(Datenausgabe!E175=2,Nebenrechnungen!E190,IF(Datenausgabe!E175=1,0,IF(Datenausgabe!E146=1,Nebenrechnungen!E305,0)))","v":0.12},{"$f":"IF(Datenausgabe!F175=2,Nebenrechnungen!F190,IF(Datenausgabe!F175=1,0,IF(Datenausgabe!F146=1,Nebenrechnungen!F305,0)))","v":0.12},{"$f":"IF(Datenausgabe!G175=2,Nebenrechnungen!G190,IF(Datenausgabe!G175=1,0,IF(Datenausgabe!G146=1,Nebenrechnungen!G305,0)))","v":0.12},{"$f":"IF(Datenausgabe!H175=2,Nebenrechnungen!H190,IF(Datenausgabe!H175=1,0,IF(Datenausgabe!H146=1,Nebenrechnungen!H305,0)))","v":0.12},{"$f":"IF(Datenausgabe!I175=2,Nebenrechnungen!I190,IF(Datenausgabe!I175=1,0,IF(Datenausgabe!I146=1,Nebenrechnungen!I305,0)))","v":0.12},{"$f":"IF(Datenausgabe!J175=2,Nebenrechnungen!J190,IF(Datenausgabe!J175=1,0,IF(Datenausgabe!J146=1,Nebenrechnungen!J305,0)))","v":0.12},{"$f":"IF(Datenausgabe!K175=2,Nebenrechnungen!K190,IF(Datenausgabe!K175=1,0,IF(Datenausgabe!K146=1,Nebenrechnungen!K305,0)))","v":0.12},{"$f":"IF(Datenausgabe!L175=2,Nebenrechnungen!L190,IF(Datenausgabe!L175=1,0,IF(Datenausgabe!L146=1,Nebenrechnungen!L305,0)))","v":0.12},{"$f":"IF(Datenausgabe!M175=2,Nebenrechnungen!M190,IF(Datenausgabe!M175=1,0,IF(Datenausgabe!M146=1,Nebenrechnungen!M305,0)))","v":0.12},1.44]
[41,{"$f":"IF(Datenausgabe!B175=1,\"Pausch. KV Beitrag für EZ\",\"Krankenversicherung EGA\")","v":"Krankenversicherung EGA"},null,null,null,{"$f":"IF(Datenausgabe!B175=0,IF(Datenausgabe!B146=1,Nebenrechnungen!B301,0),0)","v":0},{"$f":"IF(Datenausgabe!C175=0,IF(Datenausgabe!C146=1,Nebenrechnungen!C301,0),0)","v":0},{"$f":"IF(Datenausgabe!D175=0,IF(Datenausgabe!D146=1,Nebenrechnungen!D301,0),0)","v":0},{"$f":"IF(Datenausgabe!E175=0,IF(Datenausgabe!E146=1,Nebenrechnungen!E301,0),0)","v":0},{"$f":"IF(Datenausgabe!F175=0,IF(Datenausgabe!F146=1,Nebenrechnungen!F301,0),0)","v":0},{"$f":"IF(Datenausgabe!G175=0,IF(Datenausgabe!G146=1,Nebenrechnungen!G301,0),0)","v":0},{"$f":"IF(Datenausgabe!H175=0,IF(Datenausgabe!H146=1,Nebenrechnungen!H301,0),0)","v":0},{"$f":"IF(Datenausgabe!I175=0,IF(Datenausgabe!I146=1,Nebenrechnungen!I301,0),0)","v":0},{"$f":"IF(Datenausgabe!J175=0,IF(Datenausgabe!J146=1,Nebenrechnungen!J301,0),0)","v":0},{"$f":"IF(Datenausgabe!K175=0,IF(Datenausgabe!K146=1,Nebenrechnungen!K301,0),0)","v":0},{"$f":"IF(Datenausgabe!L175=0,IF(Datenausgabe!L146=1,Nebenrechnungen!L301,0),0)","v":0},{"$f":"IF(Datenausgabe!M175=0,IF(Datenausgabe!M146=1,Nebenrechnungen!M301,0),0)","v":0},0]
[42,{"$f":"IF(Datenausgabe!B175=1,\"Pausch. RV Beitrag für EZ\",\"Rentenversicherung EGA\")","v":"Rentenversicherung EGA"},null,null,null,{"$f":"IF(Datenausgabe!B175=0,ROUND(F32*Datenausgabe!B140/100,2)+ROUND(F32*Datenausgabe!B144/100,2),0)","v":0},{"$f":"IF(Datenausgabe!C175=0,ROUND(G32*Datenausgabe!C140/100,2)+ROUND(G32*Datenausgabe!C144/100,2),0)","v":0},{"$f":"IF(Datenausgabe!D175=0,ROUND(H32*Datenausgabe!D140/100,2)+ROUND(H32*Datenausgabe!D144/100,2),0)","v":0},{"$f":"IF(Datenausgabe!E175=0,ROUND(I32*Datenausgabe!E140/100,2)+ROUND(I32*Datenausgabe!E144/100,2),0)","v":0},{"$f":"IF(Datenausgabe!F175=0,ROUND(J32*Datenausgabe!F140/100,2)+ROUND(J32*Datenausgabe!F144/100,2),0)","v":0},{"$f":"IF(Datenausgabe!G175=0,ROUND(K32*Datenausgabe!G140/100,2)+ROUND(K32*Datenausgabe!G144/100,2),0)","v":0},{"$f":"IF(Datenausgabe!H175=0,ROUND(L32*Datenausgabe!H140/100,2)+ROUND(L32*Datenausgabe!H144/100,2),0)","v":0},{"$f":"IF(Datenausgabe!I175=0,ROUND(M32*Datenausgabe!I140/100,2)+ROUND(M32*Datenausgabe!I144/100,2),0)","v":0},{"$f":"IF(Datenausgabe!J175=0,ROUND(N32*Datenausgabe!J140/100,2)+ROUND(N32*Datenausgabe!J144/100,2),0)","v":0},{"$f":"IF(Datenausgabe!K175=0,ROUND(O32*Datenausgabe!K140/100,2)+ROUND(O32*Datenausgabe!K144/100,2),0)","v":0},{"$f":"IF(Datenausgabe!L175=0,ROUND(P32*Datenausgabe!L140/100,2)+ROUND(P32*Datenausgabe!L144/100,2),0)","v":0},{"$f":"IF(Datenausgabe!M175=0,ROUND(Q32*Datenausgabe!M140/100,2)+ROUND(Q32*Datenausgabe!M144/100,2),0)","v":0},0]
[43,{"$f":"IF(Datenausgabe!B175=1,\"Aufstockung RV aus EZ\",\"Arbeitslosenversicherung EGA\")","v":"Arbeitslosenversicherung EGA"},null,null,null,{"$f":"IF(Datenausgabe!B175=0,ROUND(F32*Datenausgabe!B141/100,2)+ROUND(F32*Datenausgabe!B145/100,2),IF(Datenausgabe!B175=1,IF(Datenausgabe!B186,F32*(2*Datenausgabe!B140-Datenausgabe!B183)/100,0),0))","v":0},{"$f":"IF(Datenausgabe!C175=0,ROUND(G32*Datenausgabe!C141/100,2)+ROUND(G32*Datenausgabe!C145/100,2),IF(Datenausgabe!C175=1,IF(Datenausgabe!C186,G32*(2*Datenausgabe!C140-Datenausgabe!C183)/100,0),0))","v":0},{"$f":"IF(Datenausgabe!D175=0,ROUND(H32*Datenausgabe!D141/100,2)+ROUND(H32*Datenausgabe!D145/100,2),IF(Datenausgabe!D175=1,IF(Datenausgabe!D186,H32*(2*Datenausgabe!D140-Datenausgabe!D183)/100,0),0))","v":0},{"$f":"IF(Datenausgabe!E175=0,ROUND(I32*Datenausgabe!E141/100,2)+ROUND(I32*Datenausgabe!E145/100,2),IF(Datenausgabe!E175=1,IF(Datenausgabe!E186,I32*(2*Datenausgabe!E140-Datenausgabe!E183)/100,0),0))","v":0},{"$f":"IF(Datenausgabe!F175=0,ROUND(J32*Datenausgabe!F141/100,2)+ROUND(J32*Datenausgabe!F145/100,2),IF(Datenausgabe!F175=1,IF(Datenausgabe!F186,J32*(2*Datenausgabe!F140-Datenausgabe!F183)/100,0),0))","v":0},{"$f":"IF(Datenausgabe!G175=0,ROUND(K32*Datenausgabe!G141/100,2)+ROUND(K32*Datenausgabe!G145/100,2),IF(Datenausgabe!G175=1,IF(Datenausgabe!G186,K32*(2*Datenausgabe!G140-Datenausgabe!G183)/100,0),0))","v":0},{"$f":"IF(Datenausgabe!H175=0,ROUND(L32*Datenausgabe!H141/100,2)+ROUND(L32*Datenausgabe!H145/100,2),IF(Datenausgabe!H175=1,IF(Datenausgabe!H186,L32*(2*Datenausgabe!H140-Datenausgabe!H183)/100,0),0))","v":0},{"$f":"IF(Datenausgabe!I175=0,ROUND(M32*Datenausgabe!I141/100,2)+ROUND(M32*Datenausgabe!I145/100,2),IF(Datenausgabe!I175=1,IF(Datenausgabe!I186,M32*(2*Datenausgabe!I140-Datenausgabe!I183)/100,0),0))","v":0},{"$f":"IF(Datenausgabe!J175=0,ROUND(N32*Datenausgabe!J141/100,2)+ROUND(N32*Datenausgabe!J145/100,2),IF(Datenausgabe!J175=1,IF(Datenausgabe!J186,N32*(2*Datenausgabe!J140-Datenausgabe!J183)/100,0),0))","v":0},{"$f":"IF(Datenausgabe!K175=0,ROUND(O32*Datenausgabe!K141/100,2)+ROUND(O32*Datenausgabe!K145/100,2),IF(Datenausgabe!K175=1,IF(Datenausgabe!K186,O32*(2*Datenausgabe!K140-Datenausgabe!K183)/100,0),0))","v":0},{"$f":"IF(Datenausgabe!L175=0,ROUND(P32*Datenausgabe!L141/100,2)+ROUND(P32*Datenausgabe!L145/100,2),IF(Datenausgabe!L175=1,IF(Datenausgabe!L186,P32*(2*Datenausgabe!L140-Datenausgabe!L183)/100,0),0))","v":0},{"$f":"IF(Datenausgabe!M175=0,ROUND(Q32*Datenausgabe!M141/100,2)+ROUND(Q32*Datenausgabe!M145/100,2),IF(Datenausgabe!M175=1,IF(Datenausgabe!M186,Q32*(2*Datenausgabe!M140-Datenausgabe!M183)/100,0),0))","v":0},0]
[44,{"$f":"IF(Datenausgabe!B175=1,\"\",\"Pflegeversicherung EGA\")","v":"Pflegeversicherung EGA"},null,null,null,{"$f":"IF(Datenausgabe!B175=0,IF(Datenausgabe!B146=1,Nebenrechnungen!B306,0),0)","v":0},{"$f":"IF(Datenausgabe!C175=0,IF(Datenausgabe!C146=1,Nebenrechnungen!C306,0),0)","v":0},{"$f":"IF(Datenausgabe!D175=0,IF(Datenausgabe!D146=1,Nebenrechnungen!D306,0),0)","v":0},{"$f":"IF(Datenausgabe!E175=0,IF(Datenausgabe!E146=1,Nebenrechnungen!E306,0),0)","v":0},{"$f":"IF(Datenausgabe!F175=0,IF(Datenausgabe!F146=1,Nebenrechnungen!F306,0),0)","v":0},{"$f":"IF(Datenausgabe!G175=0,IF(Datenausgabe!G146=1,Nebenrechnungen!G306,0),0)","v":0},{"$f":"IF(Datenausgabe!H175=0,IF(Datenausgabe!H146=1,Nebenrechnungen!H306,0),0)","v":0},{"$f":"IF(Datenausgabe!I175=0,IF(Datenausgabe!I146=1,Nebenrechnungen!I306,0),0)","v":0},{"$f":"IF(Datenausgabe!J175=0,IF(Datenausgabe!J146=1,Nebenrechnungen!J306,0),0)","v":0},{"$f":"IF(Datenausgabe!K175=0,IF(Datenausgabe!K146=1,Nebenrechnungen!K306,0),0)","v":0},{"$f":"IF(Datenausgabe!L175=0,IF(Datenausgabe!L146=1,Nebenrechnungen!L306,0),0)","v":0},{"$f":"IF(Datenausgabe!M175=0,IF(Datenausgabe!M146=1,Nebenrechnungen!M306,0),0)","v":0},0]
[45,"Pauschalsteuern",null,null,null,{"$f":"Nebenrechnungen!B147","v":0},{"$f":"Nebenrechnungen!C147","v":0},{"$f":"Nebenrechnungen!D147","v":0},{"$f":"Nebenrechnungen!E147","v":0},{"$f":"Nebenrechnungen!F147","v":0},{"$f":"Nebenrechnungen!G147","v":0},{"$f":"Nebenrechnungen!H147","v":0},{"$f":"Nebenrechnungen!I147","v":0},{"$f":"Nebenrechnungen!J147","v":0},{"$f":"Nebenrechnungen!K147","v":0},{"$f":"Nebenrechnungen!L147","v":0},{"$f":"Nebenrechnungen!M147","v":0}]
[46,"SUMME gesetzliche Abzüge",null,null,null,{"$f":"SUM(F36:F50)","v":1.34},{"$f":"SUM(G36:G50)","v":1.34},1.34,1.34,1.34,1.34,1.34,1.34,1.34,1.34,1.34,1.34,"Ä",{"$f":"SUM(F51:Q51)","v":16.079999999999998}]
[47,"Gesamtabzug VL",null,null,null,{"$f":"Datenausgabe!B193","v":0},{"$f":"Datenausgabe!C193","v":0},{"$f":"Datenausgabe!D193","v":0},{"$f":"Datenausgabe!E193","v":0},{"$f":"Datenausgabe!F193","v":0},{"$f":"Datenausgabe!G193","v":0},{"$f":"Datenausgabe!H193","v":0},{"$f":"Datenausgabe!I193","v":0},{"$f":"Datenausgabe!J193","v":0},{"$f":"Datenausgabe!K193","v":0},{"$f":"Datenausgabe!L193","v":0},{"$f":"Datenausgabe!M193","v":0},{"$f":"SUM(F52:Q52)","v":0}]
[48,"Freiwillige KV + PV insgesamt",null,null,null,{"$f":"IF(AND(Nebenrechnungen!B309>0,Datenausgabe!B175=0),Nebenrechnungen!B309,0)","v":0},{"$f":"IF(AND(Nebenrechnungen!C309>0,Datenausgabe!C175=0),Nebenrechnungen!C309,0)","v":0},{"$f":"IF(AND(Nebenrechnungen!D309>0,Datenausgabe!D175=0),Nebenrechnungen!D309,0)","v":0},{"$f":"IF(AND(Nebenrechnungen!E309>0,Datenausgabe!E175=0),Nebenrechnungen!E309,0)","v":0},{"$f":"IF(AND(Nebenrechnungen!F309>0,Datenausgabe!F175=0),Nebenrechnungen!F309,0)","v":0},{"$f":"IF(AND(Nebenrechnungen!G309>0,Datenausgabe!G175=0),Nebenrechnungen!G309,0)","v":0},{"$f":"IF(AND(Nebenrechnungen!H309>0,Datenausgabe!H175=0),Nebenrechnungen!H309,0)","v":0},{"$f":"IF(AND(Nebenrechnungen!I309>0,Datenausgabe!I175=0),Nebenrechnungen!I309,0)","v":0},{"$f":"IF(AND(Nebenrechnungen!J309>0,Datenausgabe!J175=0),Nebenrechnungen!J309,0)","v":0},{"$f":"IF(AND(Nebenrechnungen!K309>0,Datenausgabe!K175=0),Nebenrechnungen!K309,0)","v":0},{"$f":"IF(AND(Nebenrechnungen!L309>0,Datenausgabe!L175=0),Nebenrechnungen!L309,0)","v":0},{"$f":"IF(AND(Nebenrechnungen!M309>0,Datenausgabe!M175=0),Nebenrechnungen!M309,0)","v":0},{"$f":"SUM(F53:Q53)","v":0}]
[49,"Eigenanteil KZVK/VBL",null,null,null,{"$f":"F34*Datenausgabe!B159/100","v":0},{"$f":"G34*Datenausgabe!C159/100","v":0},{"$f":"H34*Datenausgabe!D159/100","v":0},{"$f":"I34*Datenausgabe!E159/100","v":0},{"$f":"J34*Datenausgabe!F159/100","v":0},{"$f":"K34*Datenausgabe!G159/100","v":0},{"$f":"L34*Datenausgabe!H159/100","v":0},{"$f":"M34*Datenausgabe!I159/100","v":0},{"$f":"N34*Datenausgabe!J159/100","v":0},{"$f":"O34*Datenausgabe!K159/100","v":0},{"$f":"P34*Datenausgabe!L159/100","v":0},{"$f":"Q34*Datenausgabe!M159/100","v":0}]
[50,{"$f":"Datenausgabe!B194","v":""},null,null,null,{"$f":"Datenausgabe!B195","v":0},{"$f":"Datenausgabe!C195","v":0},{"$f":"Datenausgabe!D195","v":0},{"$f":"Datenausgabe!E195","v":0},{"$f":"Datenausgabe!F195","v":0},{"$f":"Datenausgabe!G195","v":0},{"$f":"Datenausgabe!H195","v":0},{"$f":"Datenausgabe!I195","v":0},{"$f":"Datenausgabe!J195","v":0},{"$f":"Datenausgabe!K195","v":0},{"$f":"Datenausgabe!L195","v":0},{"$f":"Datenausgabe!M195","v":0},{"$f":"SUM(F55:Q55)","v":0}]
[51,{"$f":"Datenausgabe!B196","v":0},null,null,null,{"$f":"Datenausgabe!B197","v":0},{"$f":"Datenausgabe!C197","v":0},{"$f":"Datenausgabe!D197","v":0},{"$f":"Datenausgabe!E197","v":0},{"$f":"Datenausgabe!F197","v":0},{"$f":"Datenausgabe!G197","v":0},{"$f":"Datenausgabe!H197","v":0},{"$f":"Datenausgabe!I197","v":0},{"$f":"Datenausgabe!J197","v":0},{"$f":"Datenausgabe!K197","v":0},{"$f":"Datenausgabe!L197","v":0},{"$f":"Datenausgabe!M197","v":0},{"$f":"SUM(F56:Q56)","v":0}]
[52,"SUMME Privatabzüge",null,null,null,{"$f":"SUM(F52:F56)","v":0},{"$f":"SUM(G52:G56)","v":0},0,0,0,0,0,0,0,0,0,0,"Ä",{"$f":"SUM(F57:Q57)","v":0}]
[53,"Auszahlungsbetrag",null,null,null,{"$f":"F23-F51-F57","v":5.31},{"$f":"G23-G51-G57","v":5.31},5.31,5.31,5.31,5.31,5.31,5.31,5.31,5.31,5.31,5.31,null,{"$f":"SUM(F58:Q58)","v":63.72}]
[null,null,null,null,null,null,null,null,null,"Arbeitgeber"]
[]
[null,null,null,null,null,null,null,null,null,null,null,null,null,null,{"$f":"TODAY()","v":"2020-04-03"}]
[null,null,null,null,null,null,null,null,null,null,null,null,null,null,"Ort, Datum",null,null,"Unterschrift"]

{"sheet":"Nettoberechnung Monat","index":6,"n_rows":66,"n_cols":9,"rows_kept":66,"cut":false,"hidden":false,"merged":[[65,5,65,7],[35,5,35,7],[37,5,37,6],[39,5,39,6],[40,5,40,6],[41,5,41,6],[46,5,46,6],[47,5,47,6],[42,5,42,6],[43,5,43,6],[44,5,44,6],[45,5,45,6],[36,5,36,6],[38,5,38,6],[10,1,10,2],[11,1,11,2],[12,1,12,2],[13,1,13,2],[19,6,20,7],[16,5,16,6],[14,1,14,2],[15,1,15,2],[16,1,16,2]]}
[]
[]
[]
[]
[]
[]
[]
[]
[null,null,null,null,null,"Telefon: "]
[null,null,null,null,null,"Telefax: "]
[]
[null,null,null,null,null,"Hausadresse:"]
[]
[null,null,null,null,null,"E-Mail"]
[]
[null,null,null,null,null,"Sachbearbeiter:"]
[]
[]
[null,null,null,null,null,null,1]
[null,{"$f":"'Nettoberechnung Jahr'!B6","v":"Grundvergütung"},null,{"$f":"HLOOKUP($G$20,'Nettoberechnung Jahr'!$F$5:$Q$58,ROW()-18,0)","v":0},null,"Monat:",{"$f":"DATE(Datenausgabe!A1,'Nettoberechnung Monat'!G19,1)","v":"2020-01-01"},null,{"$f":"G20","v":"2020-01-01"}]
[null,{"$f":"'Nettoberechnung Jahr'!B7","v":"Differenz indiv. Stufe"},null,{"$f":"HLOOKUP($G$20,'Nettoberechnung Jahr'!$F$5:$Q$58,ROW()-18,0)","v":0}]
[null,{"$f":"'Nettoberechnung Jahr'!B8","v":"OZ ledigen Anteil"},null,{"$f":"HLOOKUP($G$20,'Nettoberechnung Jahr'!$F$5:$Q$58,ROW()-18,0)","v":0},null,"Entgeltgruppe:",{"$f":"HLOOKUP(TEXT($G$20,\"MMMM\"),Datenausgabe!$B$3:$M$164,4,0)&\", St. \"&HLOOKUP(TEXT($G$20,\"MMMM\"),Datenausgabe!$B$3:$M$164,6,0)","v":"KAVO nF, EG 15 Ü, St. 1"}]
[null,{"$f":"'Nettoberechnung Jahr'!B9","v":"OZ verh. Anteil"},null,{"$f":"HLOOKUP($G$20,'Nettoberechnung Jahr'!$F$5:$Q$58,ROW()-18,0)","v":0},null,"Besch. Umfang:",{"$f":"HLOOKUP(TEXT($G$20,\"MMMM\"),Datenausgabe!$B$3:$M$164,18,0)&\" / \"&HLOOKUP(TEXT($G$20,\"MMMM\"),Datenausgabe!$B$3:$M$164,19,0)&\" Stunden\"","v":"39 / 39 Stunden"}]
[null,{"$f":"'Nettoberechnung Jahr'!B10","v":"OZ Kinder Anteil"},null,{"$f":"HLOOKUP($G$20,'Nettoberechnung Jahr'!$F$5:$Q$58,ROW()-18,0)","v":0}]
[null,{"$f":"'Nettoberechnung Jahr'!B11","v":"OZ Kinder erh."},null,{"$f":"HLOOKUP($G$20,'Nettoberechnung Jahr'!$F$5:$Q$58,ROW()-18,0)","v":0},null,"Verh. OZ:",{"$f":"HLOOKUP(TEXT($G$20,\"MMMM\"),Datenausgabe!$B$3:$M$164,31,0)&IF(HLOOKUP(TEXT($G$20,\"MMMM\"),Datenausgabe!$B$3:$M$164,32,0),\", TZ gekürzt\",\", ungekürzt\")","v":"voll, TZ gekürzt"}]
[null,{"$f":"'Nettoberechnung Jahr'!B12","v":"Allg. Zulage"},null,{"$f":"HLOOKUP($G$20,'Nettoberechnung Jahr'!$F$5:$Q$58,ROW()-18,0)","v":0},null,"OZ Konkurrenz:",{"$f":"IF(HLOOKUP(TEXT($G$20,\"MMMM\"),Datenausgabe!$B$3:$M$164,39,0),\"ja\",\"nein\")","v":"nein"}]
[null,{"$f":"'Nettoberechnung Jahr'!B13","v":"VL"},null,{"$f":"HLOOKUP($G$20,'Nettoberechnung Jahr'!$F$5:$Q$58,ROW()-18,0)","v":6.65},null,"Kinder:",{"$f":"HLOOKUP(TEXT($G$20,\"MMMM\"),Datenausgabe!$B$3:$M$164,34,0)","v":0}]
[null,{"$f":"'Nettoberechnung Jahr'!B14","v":0},null,{"$f":"HLOOKUP($G$20,'Nettoberechnung Jahr'!$F$5:$Q$58,ROW()-18,0)","v":0}]
[null,{"$f":"'Nettoberechnung Jahr'!B15","v":0},null,{"$f":"HLOOKUP($G$20,'Nettoberechnung Jahr'!$F$5:$Q$58,ROW()-18,0)","v":0},null,"Steuerklasse:",{"$f":"HLOOKUP(TEXT($G$20,\"MMMM\"),Datenausgabe!$B$3:$M$164,100,0)","v":1}]
[null,{"$f":"'Nettoberechnung Jahr'!B16","v":0},null,{"$f":"HLOOKUP($G$20,'Nettoberechnung Jahr'!$F$5:$Q$58,ROW()-18,0)","v":0},null,"Kinderfreibeträge:",{"$f":"HLOOKUP(TEXT($G$20,\"MMMM\"),Datenausgabe!$B$3:$M$164,101,0)","v":0}]
[null,{"$f":"'Nettoberechnung Jahr'!B17","v":0},null,{"$f":"HLOOKUP($G$20,'Nettoberechnung Jahr'!$F$5:$Q$58,ROW()-18,0)","v":0},null,"Freibetrag:",{"$f":"HLOOKUP(TEXT($G$20,\"MMMM\"),Datenausgabe!$B$3:$M$164,106,0)&\" €\"","v":"0 €"}]
[null,{"$f":"'Nettoberechnung Jahr'!B18","v":"KV + PV Zuschuss"},null,{"$f":"HLOOKUP($G$20,'Nettoberechnung Jahr'!$F$5:$Q$58,ROW()-18,0)","v":0}]
[null,{"$f":"'Nettoberechnung Jahr'!B19","v":"Urlaubsgeld"},null,{"$f":"HLOOKUP($G$20,'Nettoberechnung Jahr'!$F$5:$Q$58,ROW()-18,0)","v":0}]
[null,{"$f":"'Nettoberechnung Jahr'!B20","v":"Leistungsentgelt"},null,{"$f":"HLOOKUP($G$20,'Nettoberechnung Jahr'!$F$5:$Q$58,ROW()-18,0)","v":0}]
[null,{"$f":"'Nettoberechnung Jahr'!B21","v":"Einmalzahlungen"},null,{"$f":"HLOOKUP($G$20,'Nettoberechnung Jahr'!$F$5:$Q$58,ROW()-18,0)","v":0}]
[null,{"$f":"'Nettoberechnung Jahr'!B22","v":"Sonderzuwendung"},null,{"$f":"HLOOKUP($G$20,'Nettoberechnung Jahr'!$F$5:$Q$58,ROW()-18,0)","v":0},null,"(Daten beziehen sich ggf. auf den 1. Grundbezug!)"]
[null,{"$f":"'Nettoberechnung Jahr'!B23","v":"SUMME"},null,{"$f":"HLOOKUP($G$20,'Nettoberechnung Jahr'!$F$5:$Q$58,ROW()-18,0)","v":6.65},null,{"$f":"'Nettoberechnung Jahr'!B24","v":"Umlage ZVK steuerfreier Teil"},null,{"$f":"HLOOKUP($G$20,'Nettoberechnung Jahr'!$F$5:$Q$58,ROW()-17,0)","v":0}]
[null,{"$f":"'Nettoberechnung Jahr'!B36","v":"Lohnsteuer"},null,{"$f":"HLOOKUP($G$20,'Nettoberechnung Jahr'!$F$5:$Q$58,ROW()-6,0)","v":0},null,{"$f":"'Nettoberechnung Jahr'!B25","v":"Umlage ZVK pauschverst. Teil"},null,{"$f":"HLOOKUP($G$20,'Nettoberechnung Jahr'!$F$5:$Q$58,ROW()-17,0)","v":0}]
[null,{"$f":"'Nettoberechnung Jahr'!B37","v":"Kirchensteuer"},null,{"$f":"HLOOKUP($G$20,'Nettoberechnung Jahr'!$F$5:$Q$58,ROW()-6,0)","v":0},null,{"$f":"'Nettoberechnung Jahr'!B26","v":"Umlage ZVK steuerplichtiger Teil"},null,{"$f":"HLOOKUP($G$20,'Nettoberechnung Jahr'!$F$5:$Q$58,ROW()-17,0)","v":0}]
[null,{"$f":"'Nettoberechnung Jahr'!B38","v":"Solidaritätszuschlag"},null,{"$f":"HLOOKUP($G$20,'Nettoberechnung Jahr'!$F$5:$Q$58,ROW()-6,0)","v":0},null,{"$f":"'Nettoberechnung Jahr'!B27","v":"Hinzur. Beträge  Sozialversicherung"},null,{"$f":"HLOOKUP($G$20,'Nettoberechnung Jahr'!$F$5:$Q$58,ROW()-17,0)","v":0}]
[null,{"$f":"'Nettoberechnung Jahr'!B39","v":"Lohnsteuer SB"},null,{"$f":"HLOOKUP($G$20,'Nettoberechnung Jahr'!$F$5:$Q$58,ROW()-6,0)","v":0},null,{"$f":"'Nettoberechnung Jahr'!B28","v":"Soz. Vers. pfl. Entgelt"},null,{"$f":"HLOOKUP($G$20,'Nettoberechnung Jahr'!$F$5:$Q$58,ROW()-17,0)","v":6.65}]
[null,{"$f":"'Nettoberechnung Jahr'!B40","v":"Kirchensteuer SB"},null,{"$f":"HLOOKUP($G$20,'Nettoberechnung Jahr'!$F$5:$Q$58,ROW()-6,0)","v":0},null,{"$f":"'Nettoberechnung Jahr'!B29","v":"KV / PV Brutto ohne Einmalzahlungen"},null,{"$f":"HLOOKUP($G$20,'Nettoberechnung Jahr'!$F$5:$Q$58,ROW()-17,0)","v":6.65}]
[null,{"$f":"'Nettoberechnung Jahr'!B41","v":"Solidaritätszuschlag SB"},null,{"$f":"HLOOKUP($G$20,'Nettoberechnung Jahr'!$F$5:$Q$58,ROW()-6,0)","v":0},null,{"$f":"'Nettoberechnung Jahr'!B30","v":"RV / AV Brutto ohne Einmalzahlungen"},null,{"$f":"HLOOKUP($G$20,'Nettoberechnung Jahr'!$F$5:$Q$58,ROW()-17,0)","v":6.65}]
[null,{"$f":"'Nettoberechnung Jahr'!B42","v":"Krankenversicherung"},{"$f":"IF(HLOOKUP(TEXT($G$20,\"MMMM\"),Datenausgabe!$B$3:$M$175,173,0)=1,\"\",(HLOOKUP(TEXT($G$20,\"MMMM\"),Datenausgabe!$B$3:$M$164,140,0)+HLOOKUP(TEXT($G$20,\"MMMM\"),Datenausgabe!$B$3:$M$164,136,0))/100)","v":8.4000000000000005E-2},{"$f":"HLOOKUP($G$20,'Nettoberechnung Jahr'!$F$5:$Q$58,ROW()-6,0)","v":0.52},null,{"$f":"'Nettoberechnung Jahr'!B31","v":"KV Anteil SB  (EGA-2)"},null,{"$f":"HLOOKUP($G$20,'Nettoberechnung Jahr'!$F$5:$Q$58,ROW()-17,0)","v":0}]
[null,{"$f":"'Nettoberechnung Jahr'!B43","v":"Rentenversicherung"},{"$f":"IF(HLOOKUP(TEXT($G$20,\"MMMM\"),Datenausgabe!$B$3:$M$175,173,0)=1,\"\",(HLOOKUP(TEXT($G$20,\"MMMM\"),Datenausgabe!$B$3:$M$164,142,0)+HLOOKUP(TEXT($G$20,\"MMMM\"),Datenausgabe!$B$3:$M$164,138,0))/100)","v":9.2999999999999999E-2},{"$f":"HLOOKUP($G$20,'Nettoberechnung Jahr'!$F$5:$Q$58,ROW()-6,0)","v":0.62},null,{"$f":"'Nettoberechnung Jahr'!B32","v":"RV Anteil SB (EGA-2)"},null,{"$f":"HLOOKUP($G$20,'Nettoberechnung Jahr'!$F$5:$Q$58,ROW()-17,0)","v":0}]
[null,{"$f":"'Nettoberechnung Jahr'!B44","v":"Arbeitslosenversicherung"},{"$f":"IF(HLOOKUP(TEXT($G$20,\"MMMM\"),Datenausgabe!$B$3:$M$175,173,0)=1,\"\",(HLOOKUP(TEXT($G$20,\"MMMM\"),Datenausgabe!$B$3:$M$164,143,0)+HLOOKUP(TEXT($G$20,\"MMMM\"),Datenausgabe!$B$3:$M$164,139,0))/100)","v":1.2E-2},{"$f":"HLOOKUP($G$20,'Nettoberechnung Jahr'!$F$5:$Q$58,ROW()-6,0)","v":0.08},null,{"$f":"'Nettoberechnung Jahr'!B33","v":"Ermäßigtes Gleitzonen Brutto"},null,{"$f":"HLOOKUP($G$20,'Nettoberechnung Jahr'!$F$5:$Q$58,ROW()-17,0)","v":0}]
[null,{"$f":"'Nettoberechnung Jahr'!B45","v":"Pflegeversicherung"},{"$f":"IF(HLOOKUP(TEXT($G$20,\"MMMM\"),Datenausgabe!$B$3:$M$175,173,0)=1,\"\",(IF(HLOOKUP(TEXT($G$20,\"MMMM\"),Datenausgabe!$B$3:$M$164,130,0),0,HLOOKUP(TEXT($G$20,\"MMMM\"),Datenausgabe!$B$3:$M$164,141,0))+HLOOKUP(TEXT($G$20,\"MMMM\"),Datenausgabe!$B$3:$M$164,137,0))/100)","v":1.78E-2},{"$f":"HLOOKUP($G$20,'Nettoberechnung Jahr'!$F$5:$Q$58,ROW()-6,0)","v":0.12},null,{"$f":"'Nettoberechnung Jahr'!B34","v":"Zus. Vers. pfl. Entgelt"},null,{"$f":"HLOOKUP($G$20,'Nettoberechnung Jahr'!$F$5:$Q$58,ROW()-17,0)","v":0}]
[null,{"$f":"'Nettoberechnung Jahr'!B46","v":"Krankenversicherung EGA"},null,{"$f":"HLOOKUP($G$20,'Nettoberechnung Jahr'!$F$5:$Q$58,ROW()-6,0)","v":0},null,{"$f":"'Nettoberechnung Jahr'!B35","v":"Steuerpflichtiges Entgelt"},null,{"$f":"HLOOKUP($G$20,'Nettoberechnung Jahr'!$F$5:$Q$58,ROW()-17,0)","v":6.65}]
[null,{"$f":"'Nettoberechnung Jahr'!B47","v":"Rentenversicherung EGA"},null,{"$f":"HLOOKUP($G$20,'Nettoberechnung Jahr'!$F$5:$Q$58,ROW()-6,0)","v":0}]
[null,{"$f":"'Nettoberechnung Jahr'!B48","v":"Arbeitslosenversicherung EGA"},null,{"$f":"HLOOKUP($G$20,'Nettoberechnung Jahr'!$F$5:$Q$58,ROW()-6,0)","v":0},null,"Bemerkungen:"]
[null,{"$f":"'Nettoberechnung Jahr'!B49","v":"Pflegeversicherung EGA"},null,{"$f":"HLOOKUP($G$20,'Nettoberechnung Jahr'!$F$5:$Q$58,ROW()-6,0)","v":0}]
[null,{"$f":"'Nettoberechnung Jahr'!B50","v":"Pauschalsteuern"},null,{"$f":"HLOOKUP($G$20,'Nettoberechnung Jahr'!$F$5:$Q$58,ROW()-6,0)","v":0}]
[null,{"$f":"'Nettoberechnung Jahr'!B51","v":"SUMME gesetzliche Abzüge"},null,{"$f":"HLOOKUP($G$20,'Nettoberechnung Jahr'!$F$5:$Q$58,ROW()-6,0)","v":1.34}]
[null,{"$f":"'Nettoberechnung Jahr'!B52","v":"Gesamtabzug VL"},null,{"$f":"HLOOKUP($G$20,'Nettoberechnung Jahr'!$F$5:$Q$58,ROW()-6,0)","v":0}]
[null,{"$f":"'Nettoberechnung Jahr'!B53","v":"Freiwillige KV + PV insgesamt"},null,{"$f":"HLOOKUP($G$20,'Nettoberechnung Jahr'!$F$5:$Q$58,ROW()-6,0)","v":0}]
[null,"VBL Eigenanteil ZVK",null,{"$f":"HLOOKUP($G$20,'Nettoberechnung Jahr'!$F$5:$Q$58,ROW()-6,0)","v":0}]
[null,{"$f":"'Nettoberechnung Jahr'!B55","v":""},null,{"$f":"HLOOKUP($G$20,'Nettoberechnung Jahr'!$F$5:$Q$58,ROW()-6,0)","v":0}]
[null,{"$f":"'Nettoberechnung Jahr'!B56","v":0},null,{"$f":"HLOOKUP($G$20,'Nettoberechnung Jahr'!$F$5:$Q$58,ROW()-6,0)","v":0}]
[null,{"$f":"'Nettoberechnung Jahr'!B57","v":"SUMME Privatabzüge"},null,{"$f":"HLOOKUP($G$20,'Nettoberechnung Jahr'!$F$5:$Q$58,ROW()-6,0)","v":0}]
[]
[null,{"$f":"'Nettoberechnung Jahr'!B58","v":"Auszahlungsbetrag"},null,{"$f":"HLOOKUP($G$20,'Nettoberechnung Jahr'!$F$5:$Q$58,ROW()-7,0)","v":5.31}]
[]
[]
[]
[]
[null,null,null,null,null,"Unterschrift"]

{"sheet":"Prüfung GFB","index":7,"n_rows":50,"n_cols":19,"rows_kept":50,"cut":false,"hidden":false,"merged":[[48,14,48,15],[1,2,1,3],[2,2,2,3],[3,2,3,3]]}
["Prüfung GFB",null,null,null,null,{"$f":"Datenausgabe!A1","v":2020}]
[null,"Name",null,null,"Familienstand:",null,null,"Tarifgruppe:",{"$f":"Datenausgabe!B6","v":"KAVO nF, EG 15 Ü"},null,null,"StKl.",{"$f":"Datenausgabe!B102","v":1}]
[null,"Vorname:",null,null,"Kinder:",null,null,"Stufe:",{"$f":"Datenausgabe!B8","v":1},null,null,"KFB:",{"$f":"Datenausgabe!B103","v":0}]
[null,"Geburtsdatum:",null,null,"Personalnummer:",null,null,"Beschäftigungsumfang:",null,{"$f":"Datenausgabe!B20&\" / \"&Datenausgabe!B21","v":"39 / 39"},null,"ST Freibetr.:",{"$f":"Datenausgabe!B108","v":0}]
[]
["Nr.",null,null,null,"Klassif.",{"$f":"DATE(Datenausgabe!$A$1,Datenausgabe!B2,1)","v":"2020-01-01"},{"$f":"DATE(Datenausgabe!$A$1,Datenausgabe!C2,1)","v":"2020-02-01"},{"$f":"DATE(Datenausgabe!$A$1,Datenausgabe!D2,1)","v":"2020-03-01"},{"$f":"DATE(Datenausgabe!$A$1,Datenausgabe!E2,1)","v":"2020-04-01"},{"$f":"DATE(Datenausgabe!$A$1,Datenausgabe!F2,1)","v":"2020-05-01"},{"$f":"DATE(Datenausgabe!$A$1,Datenausgabe!G2,1)","v":"2020-06-01"},{"$f":"DATE(Datenausgabe!$A$1,Datenausgabe!H2,1)","v":"2020-07-01"},{"$f":"DATE(Datenausgabe!$A$1,Datenausgabe!I2,1)","v":"2020-08-01"},{"$f":"DATE(Datenausgabe!$A$1,Datenausgabe!J2,1)","v":"2020-09-01"},{"$f":"DATE(Datenausgabe!$A$1,Datenausgabe!K2,1)","v":"2020-10-01"},{"$f":"DATE(Datenausgabe!$A$1,Datenausgabe!L2,1)","v":"2020-11-01"},{"$f":"DATE(Datenausgabe!$A$1,Datenausgabe!M2,1)","v":"2020-12-01"},"Summe","Gesamt"]
[{"$f":"ROW()-6","v":1},"Grundvergütung",null,null,"JJJJ1J",{"$f":"Arbeitgeberkosten!F7","v":0},{"$f":"Arbeitgeberkosten!G7","v":0},{"$f":"Arbeitgeberkosten!H7","v":0},{"$f":"Arbeitgeberkosten!I7","v":0},{"$f":"Arbeitgeberkosten!J7","v":0},{"$f":"Arbeitgeberkosten!K7","v":0},{"$f":"Arbeitgeberkosten!L7","v":0},{"$f":"Arbeitgeberkosten!M7","v":0},{"$f":"Arbeitgeberkosten!N7","v":0},{"$f":"Arbeitgeberkosten!O7","v":0},{"$f":"Arbeitgeberkosten!P7","v":0},{"$f":"Arbeitgeberkosten!Q7","v":0},{"$f":"SUM(F7:Q7)","v":0}]
[2,"Differenz indiv. Stufe",null,null,{"$f":"E7","v":"JJJJ1J"},{"$f":"Arbeitgeberkosten!F8","v":0},{"$f":"Arbeitgeberkosten!G8","v":0},{"$f":"Arbeitgeberkosten!H8","v":0},{"$f":"Arbeitgeberkosten!I8","v":0},{"$f":"Arbeitgeberkosten!J8","v":0},{"$f":"Arbeitgeberkosten!K8","v":0},{"$f":"Arbeitgeberkosten!L8","v":0},{"$f":"Arbeitgeberkosten!M8","v":0},{"$f":"Arbeitgeberkosten!N8","v":0},{"$f":"Arbeitgeberkosten!O8","v":0},{"$f":"Arbeitgeberkosten!P8","v":0},{"$f":"Arbeitgeberkosten!Q8","v":0},0]
[3,"OZ ledigen Anteil",null,null,"JJJJ1J",{"$f":"Arbeitgeberkosten!F9","v":0},{"$f":"Arbeitgeberkosten!G9","v":0},{"$f":"Arbeitgeberkosten!H9","v":0},{"$f":"Arbeitgeberkosten!I9","v":0},{"$f":"Arbeitgeberkosten!J9","v":0},{"$f":"Arbeitgeberkosten!K9","v":0},{"$f":"Arbeitgeberkosten!L9","v":0},{"$f":"Arbeitgeberkosten!M9","v":0},{"$f":"Arbeitgeberkosten!N9","v":0},{"$f":"Arbeitgeberkosten!O9","v":0},{"$f":"Arbeitgeberkosten!P9","v":0},{"$f":"Arbeitgeberkosten!Q9","v":0},0]
[4,"OZ verh. Anteil",null,null,"JPJJ1J",{"$f":"Arbeitgeberkosten!F10","v":0},{"$f":"Arbeitgeberkosten!G10","v":0},{"$f":"Arbeitgeberkosten!H10","v":0},{"$f":"Arbeitgeberkosten!I10","v":0},{"$f":"Arbeitgeberkosten!J10","v":0},{"$f":"Arbeitgeberkosten!K10","v":0},{"$f":"Arbeitgeberkosten!L10","v":0},{"$f":"Arbeitgeberkosten!M10","v":0},{"$f":"Arbeitgeberkosten!N10","v":0},{"$f":"Arbeitgeberkosten!O10","v":0},{"$f":"Arbeitgeberkosten!P10","v":0},{"$f":"Arbeitgeberkosten!Q10","v":0},0]
[5,"OZ Kinder Anteil",null,null,"JJJJ1J",{"$f":"Arbeitgeberkosten!F11","v":0},{"$f":"Arbeitgeberkosten!G11","v":0},{"$f":"Arbeitgeberkosten!H11","v":0},{"$f":"Arbeitgeberkosten!I11","v":0},{"$f":"Arbeitgeberkosten!J11","v":0},{"$f":"Arbeitgeberkosten!K11","v":0},{"$f":"Arbeitgeberkosten!L11","v":0},{"$f":"Arbeitgeberkosten!M11","v":0},{"$f":"Arbeitgeberkosten!N11","v":0},{"$f":"Arbeitgeberkosten!O11","v":0},{"$f":"Arbeitgeberkosten!P11","v":0},{"$f":"Arbeitgeberkosten!Q11","v":0},0]
[6,"OZ Kinder erh.",null,null,"JJJJ1J",{"$f":"Arbeitgeberkosten!F12","v":0},{"$f":"Arbeitgeberkosten!G12","v":0},{"$f":"Arbeitgeberkosten!H12","v":0},{"$f":"Arbeitgeberkosten!I12","v":0},{"$f":"Arbeitgeberkosten!J12","v":0},{"$f":"Arbeitgeberkosten!K12","v":0},{"$f":"Arbeitgeberkosten!L12","v":0},{"$f":"Arbeitgeberkosten!M12","v":0},{"$f":"Arbeitgeberkosten!N12","v":0},{"$f":"Arbeitgeberkosten!O12","v":0},{"$f":"Arbeitgeberkosten!P12","v":0},{"$f":"Arbeitgeberkosten!Q12","v":0},0]
[7,"Allg. Zulage",null,null,"JJJJ1J",{"$f":"Arbeitgeberkosten!F13","v":0},{"$f":"Arbeitgeberkosten!G13","v":0},{"$f":"Arbeitgeberkosten!H13","v":0},{"$f":"Arbeitgeberkosten!I13","v":0},{"$f":"Arbeitgeberkosten!J13","v":0},{"$f":"Arbeitgeberkosten!K13","v":0},{"$f":"Arbeitgeberkosten!L13","v":0},{"$f":"Arbeitgeberkosten!M13","v":0},{"$f":"Arbeitgeberkosten!N13","v":0},{"$f":"Arbeitgeberkosten!O13","v":0},{"$f":"Arbeitgeberkosten!P13","v":0},{"$f":"Arbeitgeberkosten!Q13","v":0},0]
[8,"VL",null,null,"JJJN4J",{"$f":"Arbeitgeberkosten!F14","v":6.65},{"$f":"Arbeitgeberkosten!G14","v":6.65},{"$f":"Arbeitgeberkosten!H14","v":6.65},{"$f":"Arbeitgeberkosten!I14","v":6.65},{"$f":"Arbeitgeberkosten!J14","v":6.65},{"$f":"Arbeitgeberkosten!K14","v":6.65},{"$f":"Arbeitgeberkosten!L14","v":6.65},{"$f":"Arbeitgeberkosten!M14","v":6.65},{"$f":"Arbeitgeberkosten!N14","v":6.65},{"$f":"Arbeitgeberkosten!O14","v":6.65},{"$f":"Arbeitgeberkosten!P14","v":6.65},{"$f":"Arbeitgeberkosten!Q14","v":6.65},79.8]
[9,{"$f":"Arbeitgeberkosten!B15","v":0},null,null,{"$f":"Arbeitgeberkosten!E15","v":"JJJJ1J"},{"$f":"Arbeitgeberkosten!F15","v":0},{"$f":"Arbeitgeberkosten!G15","v":0},{"$f":"Arbeitgeberkosten!H15","v":0},{"$f":"Arbeitgeberkosten!I15","v":0},{"$f":"Arbeitgeberkosten!J15","v":0},{"$f":"Arbeitgeberkosten!K15","v":0},{"$f":"Arbeitgeberkosten!L15","v":0},{"$f":"Arbeitgeberkosten!M15","v":0},{"$f":"Arbeitgeberkosten!N15","v":0},{"$f":"Arbeitgeberkosten!O15","v":0},{"$f":"Arbeitgeberkosten!P15","v":0},{"$f":"Arbeitgeberkosten!Q15","v":0},0]
[10,{"$f":"Arbeitgeberkosten!B16","v":0},null,null,"JJJJ1J",{"$f":"Arbeitgeberkosten!F16","v":0},{"$f":"Arbeitgeberkosten!G16","v":0},{"$f":"Arbeitgeberkosten!H16","v":0},{"$f":"Arbeitgeberkosten!I16","v":0},{"$f":"Arbeitgeberkosten!J16","v":0},{"$f":"Arbeitgeberkosten!K16","v":0},{"$f":"Arbeitgeberkosten!L16","v":0},{"$f":"Arbeitgeberkosten!M16","v":0},{"$f":"Arbeitgeberkosten!N16","v":0},{"$f":"Arbeitgeberkosten!O16","v":0},{"$f":"Arbeitgeberkosten!P16","v":0},{"$f":"Arbeitgeberkosten!Q16","v":0},0]
[11,{"$f":"Arbeitgeberkosten!B17","v":0},null,null,"JJJJ1J",{"$f":"Arbeitgeberkosten!F17","v":0},{"$f":"Arbeitgeberkosten!G17","v":0},{"$f":"Arbeitgeberkosten!H17","v":0},{"$f":"Arbeitgeberkosten!I17","v":0},{"$f":"Arbeitgeberkosten!J17","v":0},{"$f":"Arbeitgeberkosten!K17","v":0},{"$f":"Arbeitgeberkosten!L17","v":0},{"$f":"Arbeitgeberkosten!M17","v":0},{"$f":"Arbeitgeberkosten!N17","v":0},{"$f":"Arbeitgeberkosten!O17","v":0},{"$f":"Arbeitgeberkosten!P17","v":0},{"$f":"Arbeitgeberkosten!Q17","v":0},0]
[12,{"$f":"Arbeitgeberkosten!B18","v":0},null,null,"JJJJ1J",{"$f":"Arbeitgeberkosten!F18","v":0},{"$f":"Arbeitgeberkosten!G18","v":0},{"$f":"Arbeitgeberkosten!H18","v":0},{"$f":"Arbeitgeberkosten!I18","v":0},{"$f":"Arbeitgeberkosten!J18","v":0},{"$f":"Arbeitgeberkosten!K18","v":0},{"$f":"Arbeitgeberkosten!L18","v":0},{"$f":"Arbeitgeberkosten!M18","v":0},{"$f":"Arbeitgeberkosten!N18","v":0},{"$f":"Arbeitgeberkosten!O18","v":0},{"$f":"Arbeitgeberkosten!P18","v":0},{"$f":"Arbeitgeberkosten!Q18","v":0},0]
[13,"Urlaubsgeld",null,null,{"$f":"Datenausgabe!B67","v":"JJEN1J"},{"$f":"Arbeitgeberkosten!F19","v":0},{"$f":"Arbeitgeberkosten!G19","v":0},{"$f":"Arbeitgeberkosten!H19","v":0},{"$f":"Arbeitgeberkosten!I19","v":0},{"$f":"Arbeitgeberkosten!J19","v":0},{"$f":"Arbeitgeberkosten!K19","v":0},{"$f":"Arbeitgeberkosten!L19","v":0},{"$f":"Arbeitgeberkosten!M19","v":0},{"$f":"Arbeitgeberkosten!N19","v":0},{"$f":"Arbeitgeberkosten!O19","v":0},{"$f":"Arbeitgeberkosten!P19","v":0},{"$f":"Arbeitgeberkosten!Q19","v":0},0]
[14,{"$f":"Arbeitgeberkosten!B20","v":"Leistungsentgelt"},null,null,{"$f":"Arbeitgeberkosten!E20","v":"JSEJ1N"},{"$f":"Arbeitgeberkosten!F20","v":0},{"$f":"Arbeitgeberkosten!G20","v":0},{"$f":"Arbeitgeberkosten!H20","v":0},{"$f":"Arbeitgeberkosten!I20","v":0},{"$f":"Arbeitgeberkosten!J20","v":0},{"$f":"Arbeitgeberkosten!K20","v":0},{"$f":"Arbeitgeberkosten!L20","v":0},{"$f":"Arbeitgeberkosten!M20","v":0},{"$f":"Arbeitgeberkosten!N20","v":0},{"$f":"Arbeitgeberkosten!O20","v":0},{"$f":"Arbeitgeberkosten!P20","v":0},{"$f":"Arbeitgeberkosten!Q20","v":0},0]
[15,"Einmalzahlungen",null,null,"JJEJ1J",{"$f":"Arbeitgeberkosten!F21","v":0},{"$f":"Arbeitgeberkosten!G21","v":0},{"$f":"Arbeitgeberkosten!H21","v":0},{"$f":"Arbeitgeberkosten!I21","v":0},{"$f":"Arbeitgeberkosten!J21","v":0},{"$f":"Arbeitgeberkosten!K21","v":0},{"$f":"Arbeitgeberkosten!L21","v":0},{"$f":"Arbeitgeberkosten!M21","v":0},{"$f":"Arbeitgeberkosten!N21","v":0},{"$f":"Arbeitgeberkosten!O21","v":0},{"$f":"Arbeitgeberkosten!P21","v":0},{"$f":"Arbeitgeberkosten!Q21","v":0},0]
[16,"Sonderzuwendung",null,null,{"$f":"Datenausgabe!B76","v":"JSEJ1J"},{"$f":"Arbeitgeberkosten!F22","v":0},{"$f":"Arbeitgeberkosten!G22","v":0},{"$f":"Arbeitgeberkosten!H22","v":0},{"$f":"Arbeitgeberkosten!I22","v":0},{"$f":"Arbeitgeberkosten!J22","v":0},{"$f":"Arbeitgeberkosten!K22","v":0},{"$f":"Arbeitgeberkosten!L22","v":0},{"$f":"Arbeitgeberkosten!M22","v":0},{"$f":"Arbeitgeberkosten!N22","v":0},{"$f":"Arbeitgeberkosten!O22","v":0},{"$f":"Arbeitgeberkosten!P22","v":0},{"$f":"Arbeitgeberkosten!Q22","v":0},0]
[17,"SUMME",null,null,null,{"$f":"Arbeitgeberkosten!F23","v":6.65},{"$f":"SUM(IF(LEFT($E$7:$E$22,1)<>\"N\",G7:G22,0))","v":6.65},{"$f":"SUM(IF(LEFT($E$7:$E$22,1)<>\"N\",H7:H22,0))","v":6.65},{"$f":"SUM(IF(LEFT($E$7:$E$22,1)<>\"N\",I7:I22,0))","v":6.65},{"$f":"SUM(IF(LEFT($E$7:$E$22,1)<>\"N\",J7:J22,0))","v":6.65},{"$f":"SUM(IF(LEFT($E$7:$E$22,1)<>\"N\",K7:K22,0))","v":6.65},{"$f":"SUM(IF(LEFT($E$7:$E$22,1)<>\"N\",L7:L22,0))","v":6.65},{"$f":"SUM(IF(LEFT($E$7:$E$22,1)<>\"N\",M7:M22,0))","v":6.65},{"$f":"SUM(IF(LEFT($E$7:$E$22,1)<>\"N\",N7:N22,0))","v":6.65},{"$f":"SUM(IF(LEFT($E$7:$E$22,1)<>\"N\",O7:O22,0))","v":6.65},{"$f":"SUM(IF(LEFT($E$7:$E$22,1)<>\"N\",P7:P22,0))","v":6.65},{"$f":"SUM(IF(LEFT($E$7:$E$22,1)<>\"N\",Q7:Q22,0))","v":6.65},"Ä",{"$f":"SUM(F23:Q23)","v":79.8}]
[18,{"$f":"Arbeitgeberkosten!B24","v":"Umlage ZVK steuerfreier Teil"},null,null,null,{"$f":"Arbeitgeberkosten!F24","v":0},{"$f":"Arbeitgeberkosten!G24","v":0},{"$f":"Arbeitgeberkosten!H24","v":0},{"$f":"Arbeitgeberkosten!I24","v":0},{"$f":"Arbeitgeberkosten!J24","v":0},{"$f":"Arbeitgeberkosten!K24","v":0},{"$f":"Arbeitgeberkosten!L24","v":0},{"$f":"Arbeitgeberkosten!M24","v":0},{"$f":"Arbeitgeberkosten!N24","v":0},{"$f":"Arbeitgeberkosten!O24","v":0},{"$f":"Arbeitgeberkosten!P24","v":0},{"$f":"Arbeitgeberkosten!Q24","v":0},{"$f":"SUM(F24:Q24)","v":0}]
[19,{"$f":"Arbeitgeberkosten!B25","v":"Umlage ZVK pauschverst. Teil"},null,null,null,{"$f":"Arbeitgeberkosten!F25","v":0},{"$f":"Arbeitgeberkosten!G25","v":0},{"$f":"Arbeitgeberkosten!H25","v":0},{"$f":"Arbeitgeberkosten!I25","v":0},{"$f":"Arbeitgeberkosten!J25","v":0},{"$f":"Arbeitgeberkosten!K25","v":0},{"$f":"Arbeitgeberkosten!L25","v":0},{"$f":"Arbeitgeberkosten!M25","v":0},{"$f":"Arbeitgeberkosten!N25","v":0},{"$f":"Arbeitgeberkosten!O25","v":0},{"$f":"Arbeitgeberkosten!P25","v":0},{"$f":"Arbeitgeberkosten!Q25","v":0},0]
[20,{"$f":"Arbeitgeberkosten!B26","v":"Umlage ZVK steuerplichtiger Teil"},null,null,null,{"$f":"Arbeitgeberkosten!F26","v":0},{"$f":"Arbeitgeberkosten!G26","v":0},{"$f":"Arbeitgeberkosten!H26","v":0},{"$f":"Arbeitgeberkosten!I26","v":0},{"$f":"Arbeitgeberkosten!J26","v":0},{"$f":"Arbeitgeberkosten!K26","v":0},{"$f":"Arbeitgeberkosten!L26","v":0},{"$f":"Arbeitgeberkosten!M26","v":0},{"$f":"Arbeitgeberkosten!N26","v":0},{"$f":"Arbeitgeberkosten!O26","v":0},{"$f":"Arbeitgeberkosten!P26","v":0},{"$f":"Arbeitgeberkosten!Q26","v":0},0]
[21,{"$f":"Arbeitgeberkosten!B27","v":"Hinzur. Beträge  Sozialversicherung"},null,null,null,{"$f":"Arbeitgeberkosten!F27","v":0},{"$f":"Arbeitgeberkosten!G27","v":0},{"$f":"Arbeitgeberkosten!H27","v":0},{"$f":"Arbeitgeberkosten!I27","v":0},{"$f":"Arbeitgeberkosten!J27","v":0},{"$f":"Arbeitgeberkosten!K27","v":0},{"$f":"Arbeitgeberkosten!L27","v":0},{"$f":"Arbeitgeberkosten!M27","v":0},{"$f":"Arbeitgeberkosten!N27","v":0},{"$f":"Arbeitgeberkosten!O27","v":0},{"$f":"Arbeitgeberkosten!P27","v":0},{"$f":"Arbeitgeberkosten!Q27","v":0},0]
[22,"Soz. Vers. pfl. Entgelt",null,null,null,{"$f":"Arbeitgeberkosten!F28","v":6.65},{"$f":"Arbeitgeberkosten!G28","v":6.65},{"$f":"Arbeitgeberkosten!H28","v":6.65},{"$f":"Arbeitgeberkosten!I28","v":6.65},{"$f":"Arbeitgeberkosten!J28","v":6.65},{"$f":"Arbeitgeberkosten!K28","v":6.65},{"$f":"Arbeitgeberkosten!L28","v":6.65},{"$f":"Arbeitgeberkosten!M28","v":6.65},{"$f":"Arbeitgeberkosten!N28","v":6.65},{"$f":"Arbeitgeberkosten!O28","v":6.65},{"$f":"Arbeitgeberkosten!P28","v":6.65},{"$f":"Arbeitgeberkosten!Q28","v":6.65},79.8]
[23,"Zus. Vers. pfl. Entgelt",null,null,null,{"$f":"Arbeitgeberkosten!F34","v":0},{"$f":"Arbeitgeberkosten!G34","v":0},{"$f":"Arbeitgeberkosten!H34","v":0},{"$f":"Arbeitgeberkosten!I34","v":0},{"$f":"Arbeitgeberkosten!J34","v":0},{"$f":"Arbeitgeberkosten!K34","v":0},{"$f":"Arbeitgeberkosten!L34","v":0},{"$f":"Arbeitgeberkosten!M34","v":0},{"$f":"Arbeitgeberkosten!N34","v":0},{"$f":"Arbeitgeberkosten!O34","v":0},{"$f":"Arbeitgeberkosten!P34","v":0},{"$f":"Arbeitgeberkosten!Q34","v":0},0]
[24,"Beitrag  Zusatz Vers.",null,null,null,{"$f":"Arbeitgeberkosten!F46","v":0},{"$f":"Arbeitgeberkosten!G46","v":0},{"$f":"Arbeitgeberkosten!H46","v":0},{"$f":"Arbeitgeberkosten!I46","v":0},{"$f":"Arbeitgeberkosten!J46","v":0},{"$f":"Arbeitgeberkosten!K46","v":0},{"$f":"Arbeitgeberkosten!L46","v":0},{"$f":"Arbeitgeberkosten!M46","v":0},{"$f":"Arbeitgeberkosten!N46","v":0},{"$f":"Arbeitgeberkosten!O46","v":0},{"$f":"Arbeitgeberkosten!P46","v":0},{"$f":"Arbeitgeberkosten!Q46","v":0},0]
[25,"Pauschal zu versteuernder Betrag für ZVK",null,null,null,{"$f":"Arbeitgeberkosten!F47","v":0},{"$f":"Arbeitgeberkosten!G47","v":0},{"$f":"Arbeitgeberkosten!H47","v":0},{"$f":"Arbeitgeberkosten!I47","v":0},{"$f":"Arbeitgeberkosten!J47","v":0},{"$f":"Arbeitgeberkosten!K47","v":0},{"$f":"Arbeitgeberkosten!L47","v":0},{"$f":"Arbeitgeberkosten!M47","v":0},{"$f":"Arbeitgeberkosten!N47","v":0},{"$f":"Arbeitgeberkosten!O47","v":0},{"$f":"Arbeitgeberkosten!P47","v":0},{"$f":"Arbeitgeberkosten!Q47","v":0},0]
[26,"SV Brutto:",null,null,null,{"$f":"F28","v":6.65},{"$f":"G28","v":6.65},6.65,6.65,6.65,6.65,6.65,6.65,6.65,6.65,6.65,6.65,null,{"$f":"SUM(F32:Q32)","v":79.8}]
[]
[]
[null,null,null,null,null,null,null,null,null,null,null,null,null,null,null,null,null,"GFB Grenze:",{"$f":"SUM(Datenausgabe!B180:M180)","v":5400}]
[null,null,null,null,null,null,null,null,null,null,null,null,null,null,null,null,null,{"$f":"\"Die GFB Grenze wird \"&IF(S32>S35,\"überschritten um:\",\"unterschritten um:\")","v":"Die GFB Grenze wird unterschritten um:"},{"$f":"IF(S32>S35,S32-S35,S35-S32)","v":5320.2}]
[]
[null,null,null,null,null,null,null,null,null,null,null,null,null,null,null,null,null,null,{"$f":"\"Es handelt sich daher \"&IF(S32>S35,\"nicht\",\"\")&\" um einen GFB Fall!\"","v":"Es handelt sich daher  um einen GFB Fall!"}]
[]
[]
[]
[null,null,null,null,null,null,null,null,null,null,null,null,null,null,null,"Arbeitgeber"]
[]
[]
[]
[]
[]
[]
[null,null,null,null,null,null,null,null,null,null,null,null,null,null,{"$f":"TODAY()","v":"2020-04-03"}]
[null,null,null,null,null,null,null,null,null,null,null,null,null,null,"Ort, Datum",null,null,"Unterschrift"]

{"sheet":"Berechnungsgrundlagen","index":8,"n_rows":41,"n_cols":13,"rows_kept":41,"cut":false,"hidden":false,"merged":[[2,1,2,2],[3,1,3,2],[4,1,4,2]]}
["Berechnungsgrundlagen"]
[]
["Name"]
["Vorname:"]
["Geburtsdatum:"]
["Personalnummer:"]
[]
[]
[null,"Januar","Februar","März","April","Mai","Juni","Juli","August","September","Oktober","November","Dezember"]
["Entgelt:"]
["Tarif 1:",{"$f":"Datenausgabe!B6","v":"KAVO nF, EG 15 Ü"},{"$f":"Datenausgabe!C6","v":"KAVO nF, EG 15 Ü"},{"$f":"Datenausgabe!D6","v":"KAVO nF, EG 15 Ü"},{"$f":"Datenausgabe!E6","v":"KAVO nF, EG 15 Ü"},{"$f":"Datenausgabe!F6","v":"KAVO nF, EG 15 Ü"},{"$f":"Datenausgabe!G6","v":"KAVO nF, EG 15 Ü"},{"$f":"Datenausgabe!H6","v":"KAVO nF, EG 15 Ü"},{"$f":"Datenausgabe!I6","v":"KAVO nF, EG 15 Ü"},{"$f":"Datenausgabe!J6","v":"KAVO nF, EG 15 Ü"},{"$f":"Datenausgabe!K6","v":"KAVO nF, EG 15 Ü"},{"$f":"Datenausgabe!L6","v":"KAVO nF, EG 15 Ü"},{"$f":"Datenausgabe!M6","v":"KAVO nF, EG 15 Ü"}]
["Stufe 1",{"$f":"Datenausgabe!B8","v":1},{"$f":"Datenausgabe!C8","v":1},{"$f":"Datenausgabe!D8","v":1},{"$f":"Datenausgabe!E8","v":1},{"$f":"Datenausgabe!F8","v":1},{"$f":"Datenausgabe!G8","v":1},{"$f":"Datenausgabe!H8","v":1},{"$f":"Datenausgabe!I8","v":1},{"$f":"Datenausgabe!J8","v":1},{"$f":"Datenausgabe!K8","v":1},{"$f":"Datenausgabe!L8","v":1},{"$f":"Datenausgabe!M8","v":1}]
["BU 1",{"$f":"Datenausgabe!B20&\" / \"&Datenausgabe!B21","v":"39 / 39"},{"$f":"Datenausgabe!C20&\" / \"&Datenausgabe!C21","v":"39 / 39"},{"$f":"Datenausgabe!D20&\" / \"&Datenausgabe!D21","v":"39 / 39"},{"$f":"Datenausgabe!E20&\" / \"&Datenausgabe!E21","v":"39 / 39"},{"$f":"Datenausgabe!F20&\" / \"&Datenausgabe!F21","v":"39 / 39"},{"$f":"Datenausgabe!G20&\" / \"&Datenausgabe!G21","v":"39 / 39"},{"$f":"Datenausgabe!H20&\" / \"&Datenausgabe!H21","v":"39 / 39"},{"$f":"Datenausgabe!I20&\" / \"&Datenausgabe!I21","v":"39 / 39"},{"$f":"Datenausgabe!J20&\" / \"&Datenausgabe!J21","v":"39 / 39"},{"$f":"Datenausgabe!K20&\" / \"&Datenausgabe!K21","v":"39 / 39"},{"$f":"Datenausgabe!L20&\" / \"&Datenausgabe!L21","v":"39 / 39"},{"$f":"Datenausgabe!M20&\" / \"&Datenausgabe!M21","v":"39 / 39"}]
["Tarif 2:",{"$f":"IF(Datenausgabe!B$14,Datenausgabe!B7,\"\")","v":""},{"$f":"IF(Datenausgabe!C14,Datenausgabe!C7,\"\")","v":""},{"$f":"IF(Datenausgabe!D14,Datenausgabe!D7,\"\")","v":""},{"$f":"IF(Datenausgabe!E14,Datenausgabe!E7,\"\")","v":""},{"$f":"IF(Datenausgabe!F14,Datenausgabe!F7,\"\")","v":""},{"$f":"IF(Datenausgabe!G14,Datenausgabe!G7,\"\")","v":""},{"$f":"IF(Datenausgabe!H14,Datenausgabe!H7,\"\")","v":""},{"$f":"IF(Datenausgabe!I14,Datenausgabe!I7,\"\")","v":""},{"$f":"IF(Datenausgabe!J14,Datenausgabe!J7,\"\")","v":""},{"$f":"IF(Datenausgabe!K14,Datenausgabe!K7,\"\")","v":""},{"$f":"IF(Datenausgabe!L14,Datenausgabe!L7,\"\")","v":""},{"$f":"IF(Datenausgabe!M14,Datenausgabe!M7,\"\")","v":""}]
["Stufe 2",{"$f":"IF(Datenausgabe!B$14,Datenausgabe!B9,\"\")","v":""},{"$f":"IF(Datenausgabe!C$14,Datenausgabe!C9,\"\")","v":""},{"$f":"IF(Datenausgabe!D$14,Datenausgabe!D9,\"\")","v":""},{"$f":"IF(Datenausgabe!E$14,Datenausgabe!E9,\"\")","v":""},{"$f":"IF(Datenausgabe!F$14,Datenausgabe!F9,\"\")","v":""},{"$f":"IF(Datenausgabe!G$14,Datenausgabe!G9,\"\")","v":""},{"$f":"IF(Datenausgabe!H$14,Datenausgabe!H9,\"\")","v":""},{"$f":"IF(Datenausgabe!I$14,Datenausgabe!I9,\"\")","v":""},{"$f":"IF(Datenausgabe!J$14,Datenausgabe!J9,\"\")","v":""},{"$f":"IF(Datenausgabe!K$14,Datenausgabe!K9,\"\")","v":""},{"$f":"IF(Datenausgabe!L$14,Datenausgabe!L9,\"\")","v":""},{"$f":"IF(Datenausgabe!M$14,Datenausgabe!M9,\"\")","v":""}]
["BU 2",{"$f":"IF(Datenausgabe!B$14,Datenausgabe!B23&\"/\"&Datenausgabe!B24,\"\")","v":""},{"$f":"IF(Datenausgabe!C$14,Datenausgabe!C23&\"/\"&Datenausgabe!C24,\"\")","v":""},{"$f":"IF(Datenausgabe!D$14,Datenausgabe!D23&\"/\"&Datenausgabe!D24,\"\")","v":""},{"$f":"IF(Datenausgabe!E$14,Datenausgabe!E23&\"/\"&Datenausgabe!E24,\"\")","v":""},{"$f":"IF(Datenausgabe!F$14,Datenausgabe!F23&\"/\"&Datenausgabe!F24,\"\")","v":""},{"$f":"IF(Datenausgabe!G$14,Datenausgabe!G23&\"/\"&Datenausgabe!G24,\"\")","v":""},{"$f":"IF(Datenausgabe!H$14,Datenausgabe!H23&\"/\"&Datenausgabe!H24,\"\")","v":""},{"$f":"IF(Datenausgabe!I$14,Datenausgabe!I23&\"/\"&Datenausgabe!I24,\"\")","v":""},{"$f":"IF(Datenausgabe!J$14,Datenausgabe!J23&\"/\"&Datenausgabe!J24,\"\")","v":""},{"$f":"IF(Datenausgabe!K$14,Datenausgabe!K23&\"/\"&Datenausgabe!K24,\"\")","v":""},{"$f":"IF(Datenausgabe!L$14,Datenausgabe!L23&\"/\"&Datenausgabe!L24,\"\")","v":""},{"$f":"IF(Datenausgabe!M$14,Datenausgabe!M23&\"/\"&Datenausgabe!M24,\"\")","v":""}]
[]
["Familienbestandteile:"]
["Familienstand:",{"$f":"Datenausgabe!B32","v":"ledig"},{"$f":"Datenausgabe!C32","v":"ledig"},{"$f":"Datenausgabe!D32","v":"ledig"},{"$f":"Datenausgabe!E32","v":"ledig"},{"$f":"Datenausgabe!F32","v":"ledig"},{"$f":"Datenausgabe!G32","v":"ledig"},{"$f":"Datenausgabe!H32","v":"ledig"},{"$f":"Datenausgabe!I32","v":"ledig"},{"$f":"Datenausgabe!J32","v":"ledig"},{"$f":"Datenausgabe!K32","v":"ledig"},{"$f":"Datenausgabe!L32","v":"ledig"},{"$f":"Datenausgabe!M32","v":"ledig"}]
["Verh. OZ Höhe:",{"$f":"Datenausgabe!B33","v":"voll"},{"$f":"Datenausgabe!C33","v":"voll"},{"$f":"Datenausgabe!D33","v":"voll"},{"$f":"Datenausgabe!E33","v":"voll"},{"$f":"Datenausgabe!F33","v":"voll"},{"$f":"Datenausgabe!G33","v":"voll"},{"$f":"Datenausgabe!H33","v":"voll"},{"$f":"Datenausgabe!I33","v":"voll"},{"$f":"Datenausgabe!J33","v":"voll"},{"$f":"Datenausgabe!K33","v":"voll"},{"$f":"Datenausgabe!L33","v":"voll"},{"$f":"Datenausgabe!M33","v":"voll"}]
["Verh. OZ auf BU"]
["gekürzt:",{"$f":"IF(Datenausgabe!B34,\"ja\",\"nein\")","v":"ja"},{"$f":"IF(Datenausgabe!C34,\"ja\",\"nein\")","v":"ja"},{"$f":"IF(Datenausgabe!D34,\"ja\",\"nein\")","v":"ja"},{"$f":"IF(Datenausgabe!E34,\"ja\",\"nein\")","v":"ja"},{"$f":"IF(Datenausgabe!F34,\"ja\",\"nein\")","v":"ja"},{"$f":"IF(Datenausgabe!G34,\"ja\",\"nein\")","v":"ja"},{"$f":"IF(Datenausgabe!H34,\"ja\",\"nein\")","v":"ja"},{"$f":"IF(Datenausgabe!I34,\"ja\",\"nein\")","v":"ja"},{"$f":"IF(Datenausgabe!J34,\"ja\",\"nein\")","v":"ja"},{"$f":"IF(Datenausgabe!K34,\"ja\",\"nein\")","v":"ja"},{"$f":"IF(Datenausgabe!L34,\"ja\",\"nein\")","v":"ja"},{"$f":"IF(Datenausgabe!M34,\"ja\",\"nein\")","v":"ja"}]
["Kinder:",{"$f":"Datenausgabe!B36","v":0},{"$f":"Datenausgabe!C36","v":0},{"$f":"Datenausgabe!D36","v":0},{"$f":"Datenausgabe!E36","v":0},{"$f":"Datenausgabe!F36","v":0},{"$f":"Datenausgabe!G36","v":0},{"$f":"Datenausgabe!H36","v":0},{"$f":"Datenausgabe!I36","v":0},{"$f":"Datenausgabe!J36","v":0},{"$f":"Datenausgabe!K36","v":0},{"$f":"Datenausgabe!L36","v":0},{"$f":"Datenausgabe!M36","v":0}]
["Kinder-Betrag"]
["auf BU gekürzt:",{"$f":"IF(Datenausgabe!B37,\"ja\",\"nein\")","v":"ja"},{"$f":"IF(Datenausgabe!C37,\"ja\",\"nein\")","v":"ja"},{"$f":"IF(Datenausgabe!D37,\"ja\",\"nein\")","v":"ja"},{"$f":"IF(Datenausgabe!E37,\"ja\",\"nein\")","v":"ja"},{"$f":"IF(Datenausgabe!F37,\"ja\",\"nein\")","v":"ja"},{"$f":"IF(Datenausgabe!G37,\"ja\",\"nein\")","v":"ja"},{"$f":"IF(Datenausgabe!H37,\"ja\",\"nein\")","v":"ja"},{"$f":"IF(Datenausgabe!I37,\"ja\",\"nein\")","v":"ja"},{"$f":"IF(Datenausgabe!J37,\"ja\",\"nein\")","v":"ja"},{"$f":"IF(Datenausgabe!K37,\"ja\",\"nein\")","v":"ja"},{"$f":"IF(Datenausgabe!L37,\"ja\",\"nein\")","v":"ja"},{"$f":"IF(Datenausgabe!M37,\"ja\",\"nein\")","v":"ja"}]
["OZ Konkurrenz:",{"$f":"IF(Datenausgabe!B41,\"ja\",\"nein\")","v":"nein"},{"$f":"IF(Datenausgabe!C41,\"ja\",\"nein\")","v":"nein"},{"$f":"IF(Datenausgabe!D41,\"ja\",\"nein\")","v":"nein"},{"$f":"IF(Datenausgabe!E41,\"ja\",\"nein\")","v":"nein"},{"$f":"IF(Datenausgabe!F41,\"ja\",\"nein\")","v":"nein"},{"$f":"IF(Datenausgabe!G41,\"ja\",\"nein\")","v":"nein"},{"$f":"IF(Datenausgabe!H41,\"ja\",\"nein\")","v":"nein"},{"$f":"IF(Datenausgabe!I41,\"ja\",\"nein\")","v":"nein"},{"$f":"IF(Datenausgabe!J41,\"ja\",\"nein\")","v":"nein"},{"$f":"IF(Datenausgabe!K41,\"ja\",\"nein\")","v":"nein"},{"$f":"IF(Datenausgabe!L41,\"ja\",\"nein\")","v":"nein"},{"$f":"IF(Datenausgabe!M41,\"ja\",\"nein\")","v":"nein"}]
[]
["Steuern:"]
["Steuerklasse:",{"$f":"Datenausgabe!B102","v":1},{"$f":"Datenausgabe!C102","v":1},{"$f":"Datenausgabe!D102","v":1},{"$f":"Datenausgabe!E102","v":1},{"$f":"Datenausgabe!F102","v":1},{"$f":"Datenausgabe!G102","v":1},{"$f":"Datenausgabe!H102","v":1},{"$f":"Datenausgabe!I102","v":1},{"$f":"Datenausgabe!J102","v":1},{"$f":"Datenausgabe!K102","v":1},{"$f":"Datenausgabe!L102","v":1},{"$f":"Datenausgabe!M102","v":1}]
["Kinder FB:",{"$f":"Datenausgabe!B103","v":0},{"$f":"Datenausgabe!C103","v":0},{"$f":"Datenausgabe!D103","v":0},{"$f":"Datenausgabe!E103","v":0},{"$f":"Datenausgabe!F103","v":0},{"$f":"Datenausgabe!G103","v":0},{"$f":"Datenausgabe!H103","v":0},{"$f":"Datenausgabe!I103","v":0},{"$f":"Datenausgabe!J103","v":0},{"$f":"Datenausgabe!K103","v":0},{"$f":"Datenausgabe!L103","v":0},{"$f":"Datenausgabe!M103","v":0}]
["Freibetrag:",{"$f":"Datenausgabe!B108-Datenausgabe!B109","v":0},{"$f":"Datenausgabe!C108-Datenausgabe!C109","v":0},{"$f":"Datenausgabe!D108-Datenausgabe!D109","v":0},{"$f":"Datenausgabe!E108-Datenausgabe!E109","v":0},{"$f":"Datenausgabe!F108-Datenausgabe!F109","v":0},{"$f":"Datenausgabe!G108-Datenausgabe!G109","v":0},{"$f":"Datenausgabe!H108-Datenausgabe!H109","v":0},{"$f":"Datenausgabe!I108-Datenausgabe!I109","v":0},{"$f":"Datenausgabe!J108-Datenausgabe!J109","v":0},{"$f":"Datenausgabe!K108-Datenausgabe!K109","v":0},{"$f":"Datenausgabe!L108-Datenausgabe!L109","v":0},{"$f":"Datenausgabe!M108-Datenausgabe!M109","v":0}]
[]
["SV Beitragssätze:"]
["KV AG",{"$f":"(Datenausgabe!B138+Datenausgabe!B142/2)/100","v":7.85E-2},{"$f":"(Datenausgabe!C138+Datenausgabe!C142/2)/100","v":7.85E-2},{"$f":"(Datenausgabe!D138+Datenausgabe!D142/2)/100","v":7.85E-2},{"$f":"(Datenausgabe!E138+Datenausgabe!E142/2)/100","v":7.85E-2},{"$f":"(Datenausgabe!F138+Datenausgabe!F142/2)/100","v":7.85E-2},{"$f":"(Datenausgabe!G138+Datenausgabe!G142/2)/100","v":7.85E-2},{"$f":"(Datenausgabe!H138+Datenausgabe!H142/2)/100","v":7.85E-2},{"$f":"(Datenausgabe!I138+Datenausgabe!I142/2)/100","v":7.85E-2},{"$f":"(Datenausgabe!J138+Datenausgabe!J142/2)/100","v":7.85E-2},{"$f":"(Datenausgabe!K138+Datenausgabe!K142/2)/100","v":7.85E-2},{"$f":"(Datenausgabe!L138+Datenausgabe!L142/2)/100","v":7.85E-2},{"$f":"(Datenausgabe!M138+Datenausgabe!M142/2)/100","v":7.85E-2}]
["PV AG",{"$f":"Datenausgabe!B139/100","v":1.5299999999999999E-2},{"$f":"Datenausgabe!C139/100","v":1.5299999999999999E-2},{"$f":"Datenausgabe!D139/100","v":1.5299999999999999E-2},{"$f":"Datenausgabe!E139/100","v":1.5299999999999999E-2},{"$f":"Datenausgabe!F139/100","v":1.5299999999999999E-2},{"$f":"Datenausgabe!G139/100","v":1.5299999999999999E-2},{"$f":"Datenausgabe!H139/100","v":1.5299999999999999E-2},{"$f":"Datenausgabe!I139/100","v":1.5299999999999999E-2},{"$f":"Datenausgabe!J139/100","v":1.5299999999999999E-2},{"$f":"Datenausgabe!K139/100","v":1.5299999999999999E-2},{"$f":"Datenausgabe!L139/100","v":1.5299999999999999E-2},{"$f":"Datenausgabe!M139/100","v":1.5299999999999999E-2}]
["RV AG",{"$f":"Datenausgabe!B140/100","v":9.2999999999999999E-2},{"$f":"Datenausgabe!C140/100","v":9.2999999999999999E-2},{"$f":"Datenausgabe!D140/100","v":9.2999999999999999E-2},{"$f":"Datenausgabe!E140/100","v":9.2999999999999999E-2},{"$f":"Datenausgabe!F140/100","v":9.2999999999999999E-2},{"$f":"Datenausgabe!G140/100","v":9.2999999999999999E-2},{"$f":"Datenausgabe!H140/100","v":9.2999999999999999E-2},{"$f":"Datenausgabe!I140/100","v":9.2999999999999999E-2},{"$f":"Datenausgabe!J140/100","v":9.2999999999999999E-2},{"$f":"Datenausgabe!K140/100","v":9.2999999999999999E-2},{"$f":"Datenausgabe!L140/100","v":9.2999999999999999E-2},{"$f":"Datenausgabe!M140/100","v":9.2999999999999999E-2}]
["AV AG",{"$f":"Datenausgabe!B141/100","v":1.2E-2},{"$f":"Datenausgabe!C141/100","v":1.2E-2},{"$f":"Datenausgabe!D141/100","v":1.2E-2},{"$f":"Datenausgabe!E141/100","v":1.2E-2},{"$f":"Datenausgabe!F141/100","v":1.2E-2},{"$f":"Datenausgabe!G141/100","v":1.2E-2},{"$f":"Datenausgabe!H141/100","v":1.2E-2},{"$f":"Datenausgabe!I141/100","v":1.2E-2},{"$f":"Datenausgabe!J141/100","v":1.2E-2},{"$f":"Datenausgabe!K141/100","v":1.2E-2},{"$f":"Datenausgabe!L141/100","v":1.2E-2},{"$f":"Datenausgabe!M141/100","v":1.2E-2}]
["KV AN",{"$f":"(Datenausgabe!B138+Datenausgabe!B142/2)/100","v":7.85E-2},{"$f":"(Datenausgabe!C138+Datenausgabe!C142/2)/100","v":7.85E-2},{"$f":"(Datenausgabe!D138+Datenausgabe!D142/2)/100","v":7.85E-2},{"$f":"(Datenausgabe!E138+Datenausgabe!E142/2)/100","v":7.85E-2},{"$f":"(Datenausgabe!F138+Datenausgabe!F142/2)/100","v":7.85E-2},{"$f":"(Datenausgabe!G138+Datenausgabe!G142/2)/100","v":7.85E-2},{"$f":"(Datenausgabe!H138+Datenausgabe!H142/2)/100","v":7.85E-2},{"$f":"(Datenausgabe!I138+Datenausgabe!I142/2)/100","v":7.85E-2},{"$f":"(Datenausgabe!J138+Datenausgabe!J142/2)/100","v":7.85E-2},{"$f":"(Datenausgabe!K138+Datenausgabe!K142/2)/100","v":7.85E-2},{"$f":"(Datenausgabe!L138+Datenausgabe!L142/2)/100","v":7.85E-2},{"$f":"(Datenausgabe!M138+Datenausgabe!M142/2)/100","v":7.85E-2}]
["PV AN",{"$f":"(Datenausgabe!B139+Datenausgabe!B143)/100","v":1.78E-2},{"$f":"(Datenausgabe!C139+Datenausgabe!C143)/100","v":1.78E-2},{"$f":"(Datenausgabe!D139+Datenausgabe!D143)/100","v":1.78E-2},{"$f":"(Datenausgabe!E139+Datenausgabe!E143)/100","v":1.78E-2},{"$f":"(Datenausgabe!F139+Datenausgabe!F143)/100","v":1.78E-2},{"$f":"(Datenausgabe!G139+Datenausgabe!G143)/100","v":1.78E-2},{"$f":"(Datenausgabe!H139+Datenausgabe!H143)/100","v":1.78E-2},{"$f":"(Datenausgabe!I139+Datenausgabe!I143)/100","v":1.78E-2},{"$f":"(Datenausgabe!J139+Datenausgabe!J143)/100","v":1.78E-2},{"$f":"(Datenausgabe!K139+Datenausgabe!K143)/100","v":1.78E-2},{"$f":"(Datenausgabe!L139+Datenausgabe!L143)/100","v":1.78E-2},{"$f":"(Datenausgabe!M139+Datenausgabe!M143)/100","v":1.78E-2}]
["RV AN",{"$f":"(Datenausgabe!B140+Datenausgabe!B144)/100","v":9.2999999999999999E-2},{"$f":"(Datenausgabe!C140+Datenausgabe!C144)/100","v":9.2999999999999999E-2},{"$f":"(Datenausgabe!D140+Datenausgabe!D144)/100","v":9.2999999999999999E-2},{"$f":"(Datenausgabe!E140+Datenausgabe!E144)/100","v":9.2999999999999999E-2},{"$f":"(Datenausgabe!F140+Datenausgabe!F144)/100","v":9.2999999999999999E-2},{"$f":"(Datenausgabe!G140+Datenausgabe!G144)/100","v":9.2999999999999999E-2},{"$f":"(Datenausgabe!H140+Datenausgabe!H144)/100","v":9.2999999999999999E-2},{"$f":"(Datenausgabe!I140+Datenausgabe!I144)/100","v":9.2999999999999999E-2},{"$f":"(Datenausgabe!J140+Datenausgabe!J144)/100","v":9.2999999999999999E-2},{"$f":"(Datenausgabe!K140+Datenausgabe!K144)/100","v":9.2999999999999999E-2},{"$f":"(Datenausgabe!L140+Datenausgabe!L144)/100","v":9.2999999999999999E-2},{"$f":"(Datenausgabe!M140+Datenausgabe!M144)/100","v":9.2999999999999999E-2}]
["AV AN",{"$f":"(Datenausgabe!B141+Datenausgabe!B145)/100","v":1.2E-2},{"$f":"(Datenausgabe!C141+Datenausgabe!C145)/100","v":1.2E-2},{"$f":"(Datenausgabe!D141+Datenausgabe!D145)/100","v":1.2E-2},{"$f":"(Datenausgabe!E141+Datenausgabe!E145)/100","v":1.2E-2},{"$f":"(Datenausgabe!F141+Datenausgabe!F145)/100","v":1.2E-2},{"$f":"(Datenausgabe!G141+Datenausgabe!G145)/100","v":1.2E-2},{"$f":"(Datenausgabe!H141+Datenausgabe!H145)/100","v":1.2E-2},{"$f":"(Datenausgabe!I141+Datenausgabe!I145)/100","v":1.2E-2},{"$f":"(Datenausgabe!J141+Datenausgabe!J145)/100","v":1.2E-2},{"$f":"(Datenausgabe!K141+Datenausgabe!K145)/100","v":1.2E-2},{"$f":"(Datenausgabe!L141+Datenausgabe!L145)/100","v":1.2E-2},{"$f":"(Datenausgabe!M141+Datenausgabe!M145)/100","v":1.2E-2}]

{"sheet":"Höhergruppierung - HT","index":9,"n_rows":26,"n_cols":7,"rows_kept":26,"cut":false,"hidden":false,"merged":[[7,1,7,6],[0,1,0,6],[2,3,2,6],[4,3,4,6],[5,3,5,6]]}
[null,"Berechnung Höhergruppierung / Höherw. Tätigkeit"]
[]
[null,"Name:"]
[null,"Vorname:"]
[null,"Personalnummer:"]
[null,"Arbeitgeber / Einrichtung:"]
[]
[null,{"$f":"IF(OR(COUNTIF(Datenausgabe!B86:M86,TRUE)=0,COUNTIF(Datenausgabe!B86:M86,TRUE)>1),\"Kein Monat oder mehr als ein Monat für die Berechnung ausgewählt!\",\"\")","v":"Kein Monat oder mehr als ein Monat für die Berechnung ausgewählt!"}]
[null,"Höhergruppierung ab:"]
[null,"von","Entgeltgruppe",{"$f":"Verggrp(Nebenrechnungen!B235:M235)","v":0}]
[null,null,"Stufe:",{"$f":"SUM(Nebenrechnungen!B236:M236)","v":0}]
[]
[null,"nach","Entgeltgruppe",{"$f":"Verggrp(Nebenrechnungen!B237:M237)","v":0}]
[null,null,"Stufe:",{"$f":"IF(SUM(Nebenrechnungen!B247:M247)<2,2,SUM(Nebenrechnungen!B247:M247))","v":2}]
[]
[]
[null,null,null,null,"Entgeltgruppe","Stufe"]
[null,"Altes Tabellenentgelt / indiv. Stufe:",null,null,{"$f":"D10","v":0},{"$f":"D11","v":0},{"$f":"SUM(Nebenrechnungen!B238:M238)","v":0}]
[]
[null,"Neues Tabellenentgelt:",null,null,{"$f":"D13","v":0},{"$f":"D14","v":2},{"$f":"SUM(Nebenrechnungen!B248:M248)","v":0}]
[]
[null,"Differenz:",null,null,null,null,{"$f":"G20-G18","v":0}]
[]
[null,"Garantiebetrag:",null,null,null,null,{"$f":"SUM(Nebenrechnungen!B239:M239)","v":0}]
[]
[null,"Als Zulage zu zahlender Garantiebetrag:;",null,null,null,null,{"$f":"SUM(Nebenrechnungen!B250:M250)","v":0}]

{"sheet":"SV-Größen","index":10,"n_rows":20,"n_cols":17,"rows_kept":20,"cut":false,"hidden":false,"merged":[[3,15,3,16],[0,1,0,16],[3,2,3,3],[3,4,3,5],[3,7,3,12],[3,13,3,14]]}
[null,"Übersicht der SV-Bemessungsgrößen (West)"]
[]
[]
[null,"Gilt-ab:","Bemessungsgrenze KV / PV",null,"Bemessungsgrenze RV / AV",null,"Gleitzonenfaktor","Beitragssätze",null,null,null,null,null,"JAE Grenze",null,"Bezugsgröße"]
[null,null,"Jahr","Monat","Jahr","Monat",null,"KV AN ","KV AG","RV","AV","PV","PV Zuschlag \nKinderlose","KV Allgemein","Bestandsfälle PKV","Jahr","Monat"]
[null,null,null,null,null,null,null,"(*)"]
[null,"2017-01-01",52200,4350,76200,6350,0.75090000000000001,7.2999999999999995E-2,7.2999999999999995E-2,9.35E-2,1.4999999999999999E-2,1.2749999999999999E-2,2.5000000000000001E-3,57600,52200,35700,2975]
[null,"2016-01-01",50850,4237.5,74400,6200,0.75470000000000004,7.2999999999999995E-2,7.2999999999999995E-2,9.35E-2,1.4999999999999999E-2,1.175E-2,2.5000000000000001E-3,56250,50850,34860,2905]
[null,"2015-01-01",49500,4125,{"$f":"F9*12","v":72600},6050,0.75849999999999995,7.2999999999999995E-2,7.2999999999999995E-2,9.35E-2,1.4999999999999999E-2,1.175E-2,2.5000000000000001E-3,54900,49500,{"$f":"Q9*12","v":34020},2835]
[null,"2014-01-01",48600,4050,71400,5950,0.76049999999999995,8.2000000000000003E-2,7.2999999999999995E-2,9.4500000000000001E-2,1.4999999999999999E-2,1.025E-2,2.5000000000000001E-3,53550,48600,33180,2765]
[null,"2013-01-01",47250,3937.5,69600,5800,0.76049999999999995,8.2000000000000003E-2,7.2999999999999995E-2,9.4500000000000001E-2,1.4999999999999999E-2,1.025E-2,2.5000000000000001E-3,52200,47250,32340,2695]
[null,"2012-01-01",45900,3825,67200,5600,0.74909999999999999,8.2000000000000003E-2,7.2999999999999995E-2,9.8000000000000004E-2,1.4999999999999999E-2,9.75E-3,2.5000000000000001E-3,50850,45900,31500,2625]
[null,"2011-01-01",44550,3712.5,66000,5500,0.74350000000000005,8.2000000000000003E-2,7.2999999999999995E-2,9.9500000000000005E-2,1.4999999999999999E-2,9.75E-3,2.5000000000000001E-3,49500,44550,30660,2555]
[null,"2010-01-01",45000,3750,66000,5500,0.75849999999999995,7.9000000000000001E-2,7.0000000000000007E-2,9.9500000000000005E-2,1.4E-2,9.75E-3,2.5000000000000001E-3,49950,45000,30660,2555]
[null,"2009-07-01",44100,3675,64800,5400,0.74719999999999998,7.9000000000000001E-2,7.0000000000000007E-2,9.9500000000000005E-2,1.4E-2,9.75E-3,2.5000000000000001E-3,48600,44100,30240,2520]
[null,"2009-01-01",44100,3675,64800,5400,0.74719999999999998,8.1000000000000003E-2,7.2999999999999995E-2,9.9500000000000005E-2,1.4E-2,9.75E-3,2.5000000000000001E-3,48600,44100,30240,2520]
[null,"2008-07-01",43200,3600,63600,5300,0.7732,"-","-",9.9500000000000005E-2,1.6500000000000001E-2,9.75E-3,2.5000000000000001E-3,48150,43200,29820,2485]
[null,"2008-01-01",43200,3600,63600,5300,0.7732,"-","-",9.9500000000000005E-2,1.6500000000000001E-2,8.5000000000000006E-3,2.5000000000000001E-3,48150,43200,29820,2485]
[]
[null,null,null,null,null,null,null,"(*) +evtl. Zusatzbeitrag ab 2015"]